program: Gaussian 09
title: 000050944
version: EM64L-G09RevD.01
frameworkgroup: C1[X(C9H11NO5S)]
method: RPBEPBE
basis: SDD
operation: Freq
keyword: #p
keyword: freq=noraman
keyword: PBEPBE/SDD
title: #p freq=noraman PBEPBE/SDD
converged: YES YES NO NO
title: Mulliken charges:
elementType: S O O O O O N C C C C C C C C C H H H H H H H H H H H
charge: 0.949222 -0.254355 -0.525675 -0.541738 -0.317669 -0.227374 -0.720928 -0.217450 0.384006 -0.222560 -0.476833 0.359142 -0.347527 0.188854 -0.535265 -0.513376 0.300404 0.297357 0.259158 0.351153 0.336197 0.227591 0.254305 0.229555 0.273032 0.266402 0.224371
chargesum: 0.00000
title: Mulliken charges with hydrogens summed into heavy atoms:
elementType: S O O O O O N C C C C C C C C C
charge: 0.949222 -0.254355 -0.525675 -0.541738 -0.317669 -0.227374 -0.033577 -0.217450 0.384006 0.077844 -0.179476 0.359142 -0.088369 0.188854 0.176186 0.250429
polarizability: 2.08862542e+02 -1.67576975e+00 1.53346688e+02 -2.91253092e+00 -5.63078118e+00 9.07847745e+01
1716.lowfreq: -1.6794 -0.0026 -0.0023 -0.0016 8.9179 10.2937 42.4039 62.7484 76.3570
frequency: 42.3674 62.7357 76.3488 83.7554 96.5819 114.8139 134.0133 152.5969 174.7985 195.9786 219.1583 233.2823 244.1348 259.2019 273.1680 285.8775 302.7615 350.2468 373.0184 382.6315 400.2179 433.3877 464.1769 478.5041 530.2931 579.4685 592.8855 656.1825 697.6250 737.6007 753.9967 781.2663 815.1910 824.4912 837.4530 916.4743 920.9446 930.9770 977.6868 991.6277 999.5942 1066.9074 1090.8184 1112.9366 1120.7330 1139.8911 1156.3600 1160.7649 1200.6352 1239.5144 1271.5204 1389.1817 1407.7783 1414.2799 1437.2881 1455.8256 1459.6497 1470.2787 1471.1848 1477.7829 1505.9514 1571.5391 1609.7142 1640.9701 2970.3757 3010.2587 3063.1522 3127.3268 3137.4763 3143.1008 3147.4337 3175.1861 3177.6969 3374.7680 3551.7281
redmass: 5.6651 3.2022 1.9194 1.9749 3.4787 5.7059 4.7901 5.1857 3.8912 4.1232 2.0676 2.1674 4.4542 2.4894 3.6739 5.0034 5.6627 4.0756 5.0678 3.0602 5.6779 4.4060 5.2521 3.9214 4.1942 5.0095 5.4119 6.9430 4.7060 5.8552 4.1422 2.1899 4.5567 5.6486 1.4355 2.1133 6.1685 4.1639 1.3514 5.5048 6.5396 1.6638 1.8020 1.2582 1.3089 1.4796 1.4333 1.5099 2.3175 1.9554 2.1851 5.6717 2.0354 1.7107 1.3598 1.0537 2.3714 1.0501 1.0603 1.0538 1.0956 6.5385 7.0065 10.4725 1.0327 1.0279 1.1045 1.1058 1.1001 1.1059 1.0900 1.0923 1.0941 1.0404 1.1016
irintensity: 5.3629 1.4814 2.3080 3.1852 5.1525 0.5357 0.2023 4.1957 2.3921 8.9151 5.1418 7.9885 4.1387 11.2695 10.5764 8.2636 3.7655 12.6528 11.6783 15.4080 83.7098 10.2399 27.6588 114.6609 40.8702 15.8630 11.2726 3.5694 4.3602 7.9656 1.5854 109.6032 41.0078 53.1556 39.2922 36.2387 77.6092 7.6649 1.1699 2.7887 211.7020 70.3129 50.6329 0.1284 0.3687 0.9949 3.2357 22.3589 21.6779 204.2655 282.4727 23.3205 15.6724 115.5082 9.0025 18.8134 29.7382 16.2081 24.9657 13.4108 27.9152 116.1250 29.0303 183.4878 55.8116 31.1477 39.0177 9.9257 17.7355 8.3464 6.5628 1.4748 10.8713 22.9738 52.6587
temp: 298.150 k
press: 1.00000 atm
elementType: 16 8 8 8 8 8 7 6 6 6 6 6 6 6 6 6 1 1 1 1 1 1 1 1 1 1 1
symmnumber: 1
zpe: 509175.7 jmol-1
zpe.correction: 0.193935 hartree
zpe.thermalcorrener: 0.211137 hartree
zpe.thermalcorrenthalpy: 0.212081 hartree
zpe.thermalcorrgfe: 0.149076 hartree
zpe.sumelectzpe: -1177.087055 hartree
zpe.sumelectthermal: -1177.069853 hartree
zpe.sumelectthermalent: -1177.068909 hartree
zpe.sumelectthermalfe: -1177.131914 hartree
dipole: 3.0923 0.6998 3.7053
dipole: 4.8766
quadrupole: -68.5151 -111.7863 -107.3539
quadrupole: -16.1154 -10.5485 0.4780
quadrupole: 27.3700 -15.9012 -11.4688 -16.1154 -10.5485 0.4780
hfenergy: -1177.2809901 hartree
pointgroup: C01 [X(C9H11N1O5S1)]
dipole: -1.2868292 0.3844166 -1.3701523 debye
polarizability: 208.14506|-0.4433187|152.8379177|-9.7330428|7.9672946|92.0110273 unknown
InChI: InChI=1S/C9H11NO5S/c1-14-6-3-4-8(16(10,12)13)7(5-6)9(11)15-2/h3-5H,10H2,1-2H3
charge 0 multiplicity 1
27 atoms
S  1.740195 -1.553022 -0.059513
O  -3.823286 0.898737 0.074549
O  2.710747 -0.810527 1.018678
O  1.467213 -3.148452 0.107847
O  2.040805 1.348688 -0.778244
O  0.873202 2.810521 0.617883
N  2.271041 -1.372215 -1.792217
C  0.042048 -0.704009 -0.122394
C  -0.147258 0.69886 -0.039145
C  -1.035506 -1.599033 -0.146825
C  -1.47041 1.182157 0.038868
C  -2.57193 0.291794 0.002957
C  -2.356186 -1.106397 -0.095043
C  0.943872 1.725196 0.003155
C  -5.010444 0.033407 0.063765
C  3.28901 2.135185 -0.59114
H  -0.830981 -2.674584 -0.183719
H  -1.648593 2.257256 0.13024
H  -3.190782 -1.811805 -0.119363
H  2.518804 -0.384645 -1.961786
H  3.00959 -2.063006 -1.997187
H  -5.074114 -0.544651 -0.877739
H  -5.86334 0.72274 0.135781
H  -5.009877 -0.654458 0.930523
H  3.889106 1.614059 0.172637
H  3.042663 3.15837 -0.267526
H  3.797111 2.13873 -1.566641
