program: Orca
programVersion: 5.0.3
elementType: C H C H C C C H H C H H C C H H H H H H H
charge: 1
multiplicity: 1
keywords: m062x cc-pVTZ EnGrad RIJCOSX verytightscf cc-pVTZ/C def2/J soscf
formula: C8H13
InChI: InChI=1/C8H13/c1-2-4-6-8-7-5-3-1/h1-2,7H,3-6,8H2
21 atoms
C  -1.996975 0.518036 0.098601
H  -2.187666 0.747785 1.150253
C  -1.996188 -1.015746 -0.146621
H  -2.682987 -1.597653 0.468833
C  -0.542865 -1.086784 0.278775
C  0.586157 -1.071387 -0.521172
C  1.901934 -0.631349 0.041056
H  2.002501 -0.969803 1.077878
H  2.733866 -1.039923 -0.538396
C  1.930933 0.935625 -0.001964
H  2.113469 1.266311 -1.030737
H  2.756913 1.307351 0.610034
C  0.571037 1.47347 0.482542
C  -0.502978 0.715989 -0.250467
H  0.49846 -1.273147 -1.58798
H  -2.139135 -1.267592 -1.201136
H  0.452758 1.384056 1.56773
H  -0.392002 0.802993 -1.334772
H  -2.6631 1.110344 -0.534304
H  0.474935 2.538443 0.229253
H  -0.379216 -1.040052 1.356098
totalener: -312.31919270 hartree
nucrepener: 387.38781538 hartree
electener: -699.70700809 hartree
oneelecener: -1175.28467449 hartree
twoeener: 475.57766640 hartree
kineticenergy: 310.05117686 hartree
xcener: -23.111380162685 hartree
chargesum: 1.0000000
charge: -0.231224 0.188577 -0.286161 0.188162 -0.065717 -0.016841 -0.314022 0.190273 0.190012 -0.270297 0.184563 0.189274 -0.298760 -0.118724 0.237490 0.189089 0.189280 0.234267 0.187876 0.207164 0.225719
charge: 0.108977 0.000638 0.109261 -0.000348 0.115510 0.181333 0.084893 0.003722 0.007470 0.096509 -0.005177 0.000965 0.065541 0.186597 0.006709 0.000302 -0.001808 0.006446 -0.001373 0.017904 0.015928
qa: -0.2312 0.1886 -0.2862 0.1882 -0.0657 -0.0168 -0.3140 0.1903 0.1900 -0.2703 0.1846 0.1893 -0.2988 -0.1187 0.2375 0.1891 0.1893 0.2343 0.1879 0.2072 0.2257
va: 3.7195 0.9627 3.7502 0.9613 3.6264 3.5738 3.7889 0.9556 0.9608 3.7261 0.9548 0.9544 3.7469 3.5886 0.9341 0.9624 0.9556 0.9426 0.9567 0.9487 0.9476
energy: -312.319192704529
dipole: 0.55177 -0.68605 -0.13429 1.84321 -1.91203 -0.06882 0.21798 -0.39040 -0.17241
magnitude: 0.22912 au
magnitude: 0.58237 debye
