program: Orca
programVersion: 5.0.3
elementType: C H C H C C C H H C H H C C H H H H H H H
charge: 1
multiplicity: 1
keywords: DSD-PBEP86/2013 def2-TZVP D3BJ RIJCOSX verytightscf def2-TZVP/C def2/J soscf noTRAH
formula: C8H13
InChI: InChI=1/C8H13/c1-2-4-6-8-7-5-3-1/h1-2,7H,3-6,8H2
21 atoms
C  -1.992638 0.518461 0.066236
H  -2.198588 0.793208 1.103964
C  -2.000169 -1.023444 -0.115935
H  -2.679187 -1.575199 0.534617
C  -0.542497 -1.0842 0.292665
C  0.570328 -1.057653 -0.530092
C  1.901363 -0.628065 0.011731
H  2.027185 -1.005446 1.032218
H  2.71703 -1.019818 -0.601062
C  1.936942 0.939041 0.025869
H  2.147062 1.304719 -0.985322
H  2.748016 1.285744 0.671259
C  0.567452 1.467847 0.492711
C  -0.490204 0.7071 -0.263952
H  0.463696 -1.27398 -1.592038
H  -2.159971 -1.32106 -1.155763
H  0.430154 1.368112 1.574808
H  -0.362627 0.803085 -1.345603
H  -2.646734 1.086252 -0.600313
H  0.469498 2.534359 0.248028
H  -0.360979 -1.025853 1.366424
totalener: -311.17778007 hartree
nucrepener: 387.55730452 hartree
electener: -698.73508459 hartree
oneelecener: -1175.33320580 hartree
twoeener: 476.59812121 hartree
kineticenergy: 310.05549383 hartree
exchangeener: -14.135838691626 hartree
correlationener: -0.950124710729 hartree
xcener: -15.085963402355 hartree
chargesum: 1.0000000
charge: -0.197611 0.163882 -0.193201 0.177255 -0.052910 -0.040087 -0.225194 0.160244 0.175690 -0.238404 0.152392 0.170109 -0.217283 -0.047639 0.211585 0.159308 0.144765 0.168314 0.172530 0.172780 0.183475
charge: -0.179256 0.152711 -0.176885 0.149533 -0.052156 0.001332 -0.199884 0.156214 0.156870 -0.207475 0.146063 0.150089 -0.221974 -0.010327 0.167951 0.151810 0.148984 0.175621 0.147869 0.165897 0.177012
qa: -0.1976 0.1639 -0.1932 0.1773 -0.0529 -0.0401 -0.2252 0.1602 0.1757 -0.2384 0.1524 0.1701 -0.2173 -0.0476 0.2116 0.1593 0.1448 0.1683 0.1725 0.1728 0.1835
va: 3.8762 0.9741 3.8815 0.9727 3.8398 3.7626 3.9049 0.9661 0.9686 3.8909 0.9708 0.9698 3.9232 3.7542 0.9396 0.9736 0.9726 0.9632 0.9710 0.9679 0.9571
total: -311.833034871 hartree
dispcorr: -0.013653837 hartree
energy: -311.846688707387
dipole: 0.55716 -0.71862 -0.16146 1.82918 -1.97160 -0.14242 0.23526 -0.42943 -0.19417
magnitude: 0.28992 au
magnitude: 0.73692 debye
