program: Orca
programVersion: 5.0.3
elementType: C H C H C C C H H C H H C C H H H H H H H
charge: 1
multiplicity: 1
keywords: DSD-PBEP86/2013 def2-TZVP RIJCOSX verytightscf def2-TZVP/C def2/J soscf noTRAH
formula: C8H13
InChI: InChI=1/C8H12.H/c1-2-4-6-8-7-5-3-1;/h1-2,7-8H,3-6H2;
21 atoms
C  -1.974591 0.653054 0.124605
H  -2.125945 0.844365 1.191599
C  -1.851069 -0.94855 -0.118673
H  -2.653133 -1.441302 0.433794
C  -0.470074 -1.347941 0.372965
C  0.672691 -1.257558 -0.385085
C  1.974977 -0.654646 0.112828
H  2.129471 -0.855329 1.177619
H  2.844701 -1.012349 -0.441046
C  1.850558 0.950097 -0.115734
H  1.972913 1.172993 -1.18021
H  2.654525 1.437142 0.438956
C  0.471387 1.345627 0.38321
C  -0.67353 1.261386 -0.371484
H  0.550108 -1.263894 -1.471293
H  -1.976383 -1.162279 -1.18474
H  -0.00064 0.000508 -0.004139
H  -0.554479 1.279187 -1.458236
H  -2.845826 1.016739 -0.423184
H  0.350187 1.326719 1.471492
H  -0.346562 -1.345418 1.45838
totalener: -311.10547061 hartree
nucrepener: 382.93506206 hartree
electener: -694.04053268 hartree
oneelecener: -1165.75434898 hartree
twoeener: 471.71381630 hartree
kineticenergy: 309.93706989 hartree
exchangeener: -12.752433373356 hartree
correlationener: -0.949854168317 hartree
xcener: -13.702287541673 hartree
chargesum: 1.0000000
charge: -0.234996 0.167424 -0.233710 0.182131 -0.092994 -0.089243 -0.235358 0.167406 0.182064 -0.234429 0.167408 0.182233 -0.091139 -0.090853 0.172563 0.167468 0.215214 0.172498 0.181998 0.172130 0.172184
charge: -0.193783 0.150790 -0.193810 0.154078 -0.105042 -0.105536 -0.193566 0.150762 0.153997 -0.193739 0.150720 0.154073 -0.105355 -0.105918 0.163329 0.150765 0.323831 0.163386 0.154018 0.163861 0.163140
qa: -0.2350 0.1674 -0.2337 0.1821 -0.0930 -0.0892 -0.2354 0.1674 0.1821 -0.2344 0.1674 0.1822 -0.0911 -0.0909 0.1726 0.1675 0.2152 0.1725 0.1820 0.1721 0.1722
va: 3.8961 0.9699 3.8952 0.9673 3.8509 3.8446 3.8968 0.9699 0.9674 3.8960 0.9699 0.9672 3.8492 3.8461 0.9642 0.9699 0.9897 0.9642 0.9674 0.9644 0.9643
total: -311.801501990 hartree
energy: -311.801501989738
dipole: -0.00135 0.00184 0.00049 -0.00438 0.00328 -0.00110 0.00389 -0.00450 -0.00061
magnitude: 0.00135 au
magnitude: 0.00343 debye
