program: Orca
programVersion: 5.0.3
elementType: C H C H C C C H H C H H C C H H H H H H H
charge: 1
multiplicity: 1
keywords: PBE0 cc-pVTZ EnGrad D3BJ RIJCOSX verytightscf cc-pVTZ/C def2/J soscf
formula: C8H13
InChI: InChI=1/C8H12.H/c1-2-4-6-8-7-5-3-1;/h1-2,7-8H,3-6H2;
21 atoms
C  -1.975895 0.654195 0.123672
H  -2.128938 0.845525 1.190479
C  -1.84993 -0.948827 -0.119685
H  -2.653018 -1.441019 0.431969
C  -0.469466 -1.348259 0.373103
C  0.673167 -1.25893 -0.384773
C  1.975845 -0.654956 0.111444
H  2.132229 -0.855651 1.176088
H  2.844913 -1.012569 -0.443786
C  1.85024 0.949246 -0.116833
H  1.971476 1.172964 -1.181468
H  2.654309 1.437215 0.437225
C  0.470771 1.343457 0.383942
C  -0.674991 1.261303 -0.371854
H  0.550055 -1.266483 -1.471257
H  -1.974319 -1.162023 -1.186031
H  0.000526 0.003063 0.002563
H  -0.554812 1.27493 -1.458288
H  -2.84659 1.015819 -0.426194
H  0.351345 1.334244 1.467929
H  -0.345914 -1.341309 1.460072
totalener: -312.01754327 hartree
nucrepener: 382.90672897 hartree
electener: -694.92427225 hartree
oneelecener: -1166.28360338 hartree
twoeener: 471.35933113 hartree
kineticenergy: 309.60583063 hartree
exchangeener: -34.146825069419 hartree
correlationener: -1.977045723807 hartree
xcener: -36.123870793226 hartree
chargesum: 1.0000000
charge: -0.197972 0.149337 -0.197983 0.159567 -0.042903 -0.042649 -0.197702 0.149250 0.159123 -0.197549 0.149189 0.159513 -0.043545 -0.041391 0.160503 0.149179 0.083651 0.160925 0.159370 0.161890 0.160197
charge: 0.110646 -0.002253 0.110574 0.002807 0.136848 0.138081 0.110166 -0.002233 0.002767 0.110873 -0.002263 0.002912 0.139530 0.140092 0.003670 -0.002388 -0.013464 0.004023 0.002782 0.002745 0.004086
qa: -0.1980 0.1493 -0.1980 0.1596 -0.0429 -0.0426 -0.1977 0.1492 0.1591 -0.1975 0.1492 0.1595 -0.0435 -0.0414 0.1605 0.1492 0.0837 0.1609 0.1594 0.1619 0.1602
va: 3.8814 0.9906 3.8812 0.9859 3.7938 3.7944 3.8816 0.9906 0.9861 3.8809 0.9909 0.9859 3.7930 3.7931 0.9950 0.9909 1.1496 0.9950 0.9860 0.9950 0.9953
dispcorr: -0.019070500 hartree
energy: -312.036613773896
dipole: 0.00139 -0.00270 -0.00131 0.00760 0.00286 0.01046 0.00074 -0.00201 -0.00127
magnitude: 0.01062 au
magnitude: 0.02699 debye
