program: Orca
programVersion: 5.0.3
elementType: C H C H C C C H H C H H C C H H H H H H H
charge: 1
multiplicity: 1
keywords: b3lyp def2-TZVP EnGrad D3BJ RIJCOSX verytightscf def2/J soscf
formula: C8H13
InChI: InChI=1/C8H13/c1-2-4-6-8-7-5-3-1/h1-2,7H,3-6,8H2
21 atoms
C  -1.995592 0.536343 0.119336
H  -2.171866 0.725874 1.18184
C  -1.935381 -0.990846 -0.172773
H  -2.673747 -1.577128 0.377426
C  -0.505408 -1.171988 0.291231
C  0.616344 -1.144995 -0.495929
C  1.91024 -0.659857 0.068043
H  2.018524 -0.951448 1.118126
H  2.770736 -1.042938 -0.487654
C  1.880502 0.902986 -0.0461
H  1.98767 1.187981 -1.099487
H  2.731187 1.33338 0.489063
C  0.548584 1.48073 0.496225
C  -0.569224 0.884104 -0.275686
H  0.533183 -1.306675 -1.570344
H  -2.03979 -1.19383 -1.242933
H  0.426623 1.333614 1.573945
H  -0.435906 0.949794 -1.358518
H  -2.736858 1.082477 -0.473926
H  0.54894 2.568487 0.310565
H  -0.35808 -1.124046 1.371663
totalener: -312.25034672 hartree
nucrepener: 384.43807379 hartree
electener: -696.68842051 hartree
oneelecener: -1169.81531204 hartree
twoeener: 473.12689153 hartree
kineticenergy: 310.54581660 hartree
exchangeener: -36.339290540669 hartree
correlationener: -2.307646324715 hartree
xcener: -38.646936865384 hartree
chargesum: 1.0000000
charge: -0.184375 0.153523 -0.186886 0.166560 -0.055720 -0.054627 -0.207757 0.149629 0.163584 -0.218631 0.144627 0.162988 -0.161015 -0.028819 0.182833 0.149328 0.143238 0.176466 0.166466 0.177431 0.161155
charge: -0.197575 0.155479 -0.191085 0.152201 -0.057294 -0.050626 -0.208917 0.156087 0.160474 -0.205651 0.149429 0.153684 -0.222539 0.053277 0.163250 0.154482 0.155044 0.170656 0.156966 0.184391 0.168267
qa: -0.1844 0.1535 -0.1869 0.1666 -0.0557 -0.0546 -0.2078 0.1496 0.1636 -0.2186 0.1446 0.1630 -0.1610 -0.0288 0.1828 0.1493 0.1432 0.1765 0.1665 0.1774 0.1612
va: 3.8575 0.9727 3.8457 0.9714 3.8070 3.7849 3.8862 0.9679 0.9696 3.8515 0.9686 0.9658 3.8790 3.6862 0.9555 0.9732 0.9734 0.9557 0.9696 0.9627 0.9653
dispcorr: -0.036154520 hartree
energy: -312.286501237773
dipole: 0.56285 -0.76259 -0.19974 1.85862 -1.59670 0.26192 0.17767 -0.31677 -0.13910
magnitude: 0.35755 au
magnitude: 0.90883 debye
