program: Orca
programVersion: 5.0.3
charge: 1
multiplicity: 1
keywords: DLPNO-CCSD(T1) tightPNO Extrapolate(3/4,def2) RIJK def2/JK verytightSCF miniprint nopop
formula: C8H13
InChI: InChI=1/C8H13/c1-2-4-6-8-7-5-3-1/h1-2,7H,3-6,8H2
21 atoms
C  -2.006375 0.699815 0.08746
H  -2.217545 0.879321 1.145779
C  -1.787328 -0.920857 -0.139262
H  -2.624482 -1.403711 0.368318
C  -0.435591 -1.340923 0.411086
C  0.699242 -1.280851 -0.361787
C  2.010609 -0.684848 0.077488
H  2.224837 -0.882277 1.132524
H  2.857958 -1.015465 -0.526119
C  1.807659 0.909266 -0.139666
H  1.870185 1.134959 -1.209166
H  2.624647 1.427527 0.365556
C  0.432316 1.295925 0.418816
C  -0.719933 1.310124 -0.359054
H  0.530952 -1.201744 -1.440308
H  -1.863073 -1.130609 -1.210307
H  0.02032 0.063287 0.405401
H  -0.567164 1.279301 -1.442172
H  -2.863282 1.003523 -0.515702
H  0.344959 1.477213 1.494075
H  -0.345556 -1.485334 1.490013
e0: -310.233971516 hartree
corrType: DLPNO BASED
e0: -310.247544768 hartree
basis: def2-TZVPP def2-QZVPP
scfener: -310.233971516 -310.247544768
corrmethod: MDCI MDCI
correner: -1.474953494 -1.545260883
corrcbsextra: -1.597340392
energy: -311.846754721954
dipole: -0.00678 -0.14951 -0.15629 0.13710 0.13694 0.27403 0.05439 -0.14655 -0.09215
magnitude: 0.32865 au
magnitude: 0.83537 debye
