program: Gaussian 09
title: 000050918
version: EM64L-G09RevD.01
frameworkgroup: C1[X(C10H4Br4)]
method: RPBEPBE
basis: SDD
operation: Freq
keyword: #pfreq=noraman
keyword: PBEPBE/SDD
title: #p freq=noraman PBEPBE/SDD
converged: NO NO NO NO
title: Mulliken charges:
elementType: Br Br Br Br C C C C C C C C C C H H H H
charge: 0.072896 0.072892 0.072893 0.072893 0.414117 0.414108 -0.361181 -0.361180 -0.361177 -0.361180 -0.187565 -0.187549 -0.187562 -0.187548 0.268785 0.268785 0.268784 0.268788
chargesum: 0.00000
title: Mulliken charges with hydrogens summed into heavy atoms:
elementType: Br Br Br Br C C C C C C C C C C
charge: 0.072896 0.072892 0.072893 0.072893 0.414117 0.414108 -0.092395 -0.092394 -0.092393 -0.092392 -0.187565 -0.187549 -0.187562 -0.187548
polarizability: 3.44452380e+02 -3.49655651e-04 1.73178434e+02 -2.09251317e-03 1.02445595e-02 5.84628730e+01
1716.lowfreq: -0.0003 -0.0001 0.0003 4.4060 6.6129 7.1750 32.2451 55.6460 100.1928
frequency: 32.2451 55.6460 100.1928 114.0340 116.1121 126.0395 178.3310 186.2033 186.5755 278.1546 289.0612 343.9180 348.6430 392.0945 417.3893 472.9818 490.2029 599.3411 625.6790 631.3864 635.1990 654.7761 749.6612 795.8569 861.0834 862.1523 873.8335 914.3539 924.3968 926.1215 1093.6493 1098.1996 1229.0468 1229.4996 1230.2428 1281.9204 1347.3715 1368.6107 1399.3212 1430.1857 1470.3728 1548.7151 1549.0323 1606.6639 3155.5779 3156.8211 3158.2009 3159.7120
redmass: 62.8532 11.1140 22.2062 5.3283 77.9757 61.1627 39.9001 9.4394 57.8799 14.0908 4.9864 9.7136 8.1254 11.0209 3.2675 2.7756 5.1583 11.4873 7.8926 10.2254 7.3685 5.0018 2.6997 4.6897 1.3242 1.3490 11.5689 1.7660 6.4740 1.5134 2.2992 2.5737 1.1728 2.0568 5.6437 1.3285 10.0146 7.7172 2.0422 11.9327 4.4670 6.9622 7.5574 7.3751 1.0922 1.0921 1.0934 1.0920
irintensity: 0.0000 0.0838 0.0404 0.0000 0.0000 0.5821 0.0000 0.0000 0.0000 0.7942 0.0000 9.2254 0.0001 34.9497 0.0000 20.2658 4.6251 0.0000 0.0000 0.0000 8.5709 0.0000 0.0000 0.0000 0.0000 0.0000 160.8175 0.0000 0.0003 72.7235 0.0001 154.1728 0.0010 59.9091 0.8076 0.1569 0.0000 10.4881 0.0000 0.0000 139.5796 83.5240 0.0003 0.0000 0.0001 2.4799 1.0696 0.0001
temp: 298.150 k
press: 1.00000 atm
elementType: 35 35 35 35 6 6 6 6 6 6 6 6 6 6 1 1 1 1
symmnumber: 1
zpe: 273315.7 jmol-1
zpe.correction: 0.104100 hartree
zpe.thermalcorrener: 0.117308 hartree
zpe.thermalcorrenthalpy: 0.118252 hartree
zpe.thermalcorrgfe: 0.060059 hartree
zpe.sumelectzpe: -436.339094 hartree
zpe.sumelectthermal: -436.325887 hartree
zpe.sumelectthermalent: -436.324942 hartree
zpe.sumelectthermalfe: -436.383135 hartree
dipole: 0.0000 0.0000 -0.0001
dipole: 0.0001
quadrupole: -127.3373 -107.5654 -121.7669
quadrupole: 0.0001 -0.0002 0.0021
quadrupole: -8.4474 11.3245 -2.8770 0.0001 -0.0002 0.0021
hfenergy: -436.4431947 hartree
pointgroup: C01 [X(C10H4Br4)]
dipole: -0.0000031 0.0000194 0.0000368 debye
dipolederiv: -0.5664636 0.2661715 0.0000522 0.4179745 -0.1865161 -0.0000397 0.0000861 -0.000043 0.013947 -0.5664594 -0.2661768 -0.0000562 -0.4179945 -0.1865398 -0.000041 -0.0000806 -0.0000381 0.0139411 -0.5664705 -0.2661732 0.0000505 -0.4179779 -0.1865199 0.0000281 0.0000604 0.0000209 0.0139437 -0.5664515 0.2661743 -0.0000711 0.4179887 -0.1865356 0.0000472 -0.0001317 0.0000548 0.0139425 0.1592579 0.0000023 -0.0000282 0.0000029 -0.0275711 -0.0000254 -0.0000794 -0.0000131 0.0448828 0.15925 0.0000021 0.0000251 0.0000046 -0.027566 -0.0000263 0.0000827 -0.000011 0.0448859 -0.3110526 -0.1511808 0.0000512 0.0036859 -0.0507481 0.0000524 0.0000692 0.0000333 -0.0898234 -0.3110551 0.1511885 -0.0000713 -0.0036824 -0.0507492 0.0000426 -0.0001034 0.0000429 -0.0898247 -0.3110539 0.1511827 0.0000392 -0.0036846 -0.0507457 0.000018 -0.00002 0.0000023 -0.0898228 -0.3110548 -0.1511883 -0.0000396 0.0036851 -0.0507563 0.0000128 0.0000205 -0.0000089 -0.0898264 0.7302401 -0.7925852 -0.000162 -0.6959249 0.2792989 0.0000759 -0.0001327 0.0000804 -0.1039385 0.7302221 0.792596 0.0001653 0.6959375 0.2793171 0.0000792 0.0001297 0.0000775 -0.1039355 0.7302359 0.7925858 -0.0001857 0.6959243 0.2793003 -0.0000357 -0.0002921 -0.0000174 -0.1039365 0.7302221 -0.7925937 0.0002303 -0.6959383 0.2793099 -0.0000768 0.0003886 -0.0000941 -0.1039364 0.0676584 0.0427011 0.0000067 -0.0152144 -0.0282441 -0.0000219 0.0000541 -0.0000198 0.1573758 0.0676586 -0.0427073 -0.0000058 0.0152115 -0.028245 -0.0000151 -0.0000495 -0.0000069 0.1573747 0.0676576 -0.0427052 -0.0000072 0.0152142 -0.0282492 -0.0000391 0.0000081 -0.0000323 0.1573747 0.0676588 0.0427062 0.0000066 -0.0152121 -0.0282402 -0.0000354 -0.00001 -0.0000276 0.1573761 unknown
polarizability: 344.4523799|0.000326|173.1784345|0.0020925|0.0102446|58.462873 unknown
InChI: InChI=1S/C10H4Br4/c11-7-1-5-2-9(13)10(14)4-6(5)3-8(7)12/h1-4H
charge 0 multiplicity 1
18 atoms
Br -4.116829 1.740584 0.000383
Br -4.116805 -1.74054 -0.000329
Br 4.116825 1.740581 -0.000154
Br 4.116805 -1.740537 0.000328
C  0.000005 0.723547 0.000176
C  -0.000003 -0.72346 -0.000115
C  1.249684 1.419578 0.00021
C  1.249691 -1.419491 -0.000158
C  -1.249688 1.419575 0.000339
C  -1.249689 -1.419494 -0.000268
C  -2.457007 0.716792 0.000178
C  -2.457004 -0.716696 -0.000127
C  2.4570 0.716787 0.000036
C  2.457004 -0.716697 -0.000009
H  1.260988 2.513918 0.00036
H  1.260965 -2.513831 -0.000252
H  -1.260974 2.513914 0.000577
H  -1.260969 -2.513831 -0.000477
