program: Orca
programVersion: 5.0.3
elementType: C H C H C C C H H C H H C C H H H H H H H
charge: 1
multiplicity: 1
keywords: m062x cc-pVTZ EnGrad RIJCOSX verytightscf cc-pVTZ/C def2/J soscf
formula: C8H13
InChI: InChI=1/C8H13/c1-2-4-6-8-7-5-3-1/h1-2,7H,3-6,8H2
21 atoms
C  -1.990473 0.580972 0.092471
H  -2.167575 0.758415 1.159111
C  -1.840673 -0.962929 -0.173537
H  -2.654605 -1.500568 0.320914
C  -0.448346 -1.293938 0.344484
C  0.645798 -1.229742 -0.446631
C  1.939218 -0.693279 0.072625
H  2.098138 -0.944513 1.126462
H  2.807627 -1.036108 -0.499825
C  1.829332 0.856911 -0.095351
H  1.876717 1.117601 -1.159066
H  2.667749 1.358943 0.395831
C  0.492909 1.43115 0.511284
C  -0.670998 1.140116 -0.318167
H  0.526943 -1.277188 -1.53067
H  -1.902919 -1.159307 -1.24881
H  0.348228 1.128992 1.551464
H  -0.568029 1.405103 -1.375342
H  -2.811613 1.002959 -0.497033
H  0.622349 2.532147 0.484803
H  -0.322317 -1.314911 1.428215
totalener: -312.28761269 hartree
nucrepener: 380.60463729 hartree
electener: -692.89224998 hartree
oneelecener: -1161.94092942 hartree
twoeener: 469.04867944 hartree
kineticenergy: 310.01650147 hartree
xcener: -23.083800038737 hartree
chargesum: 1.0000000
charge: -0.280870 0.205840 -0.280601 0.191219 -0.150315 -0.139993 -0.304924 0.188782 0.188862 -0.272721 0.180774 0.192596 -0.296786 0.073517 0.213012 0.189126 0.203723 0.261254 0.196269 0.230688 0.210547
charge: 0.091472 0.009923 0.093123 0.001550 0.080992 0.062607 0.068852 -0.000321 0.005773 0.109497 -0.006741 0.001007 0.072546 0.355072 -0.014312 0.001147 0.005893 0.019825 0.010827 0.044863 -0.013597
qa: -0.2809 0.2058 -0.2806 0.1912 -0.1503 -0.1400 -0.3049 0.1888 0.1889 -0.2727 0.1808 0.1926 -0.2968 0.0735 0.2130 0.1891 0.2037 0.2613 0.1963 0.2307 0.2105
va: 3.7124 0.9518 3.7682 0.9565 3.6481 3.6412 3.7802 0.9591 0.9598 3.7221 0.9558 0.9514 3.7481 3.3404 0.9476 0.9602 0.9553 0.9245 0.9595 0.9439 0.9525
energy: -312.287612685947
dipole: 0.48788 -0.94550 -0.45762 1.93932 -0.84882 1.09050 0.14604 -0.28815 -0.14211
magnitude: 1.19113 au
magnitude: 3.02762 debye
