program: Orca
programVersion: 5.0.3
elementType: C H C H C C C H H C H H C C H H H H H H H
charge: 1
multiplicity: 1
keywords: m062x def2-TZVP EnGrad RIJCOSX verytightscf def2/J soscf
formula: C8H13
InChI: InChI=1/C8H13/c1-2-4-6-8-7-5-3-1/h1-2,7H,3-6,8H2
21 atoms
C  -2.006342 0.696513 0.088695
H  -2.217558 0.878759 1.146578
C  -1.791339 -0.920639 -0.138508
H  -2.625917 -1.408597 0.368296
C  -0.436944 -1.339212 0.410448
C  0.698936 -1.279955 -0.361726
C  2.010422 -0.684096 0.078725
H  2.224485 -0.882339 1.133567
H  2.857425 -1.01475 -0.525267
C  1.80882 0.911059 -0.138895
H  1.872525 1.13569 -1.208513
H  2.625999 1.427988 0.367371
C  0.433965 1.299085 0.416659
C  -0.71675 1.307741 -0.357984
H  0.531447 -1.202853 -1.440463
H  -1.865782 -1.130927 -1.20969
H  0.015839 0.049279 0.366578
H  -0.564058 1.276896 -1.441024
H  -2.862346 1.004668 -0.51362
H  0.343687 1.453575 1.495649
H  -0.345059 -1.475797 1.490297
totalener: -312.24673962 hartree
nucrepener: 382.47480231 hartree
electener: -694.72154193 hartree
oneelecener: -1165.31801962 hartree
twoeener: 470.59647769 hartree
kineticenergy: 310.34956484 hartree
xcener: -23.100787978287 hartree
chargesum: 1.0000000
charge: -0.304091 0.205916 -0.352093 0.208537 -0.101400 -0.064034 -0.304149 0.202426 0.205064 -0.353154 0.211230 0.207149 -0.106626 -0.033313 0.184561 0.213112 0.136841 0.192250 0.207511 0.227185 0.217079
charge: -0.200843 0.158147 -0.196135 0.160411 -0.165245 -0.077502 -0.207418 0.156946 0.158989 -0.200094 0.155999 0.159147 -0.165815 -0.045097 0.165911 0.156336 0.316839 0.168752 0.160583 0.172964 0.167125
qa: -0.3041 0.2059 -0.3521 0.2085 -0.1014 -0.0640 -0.3041 0.2024 0.2051 -0.3532 0.2112 0.2071 -0.1066 -0.0333 0.1846 0.2131 0.1368 0.1922 0.2075 0.2272 0.2171
va: 3.7248 0.9493 3.8023 0.9567 3.5376 3.7382 3.7261 0.9502 0.9559 3.8040 0.9450 0.9582 3.5161 3.7264 0.9515 0.9444 0.9741 0.9495 0.9551 0.9434 0.9471
energy: -312.246739619959
dipole: -0.00872 -0.07962 -0.08834 0.10488 0.04461 0.14949 0.02804 -0.05208 -0.02404
magnitude: 0.17529 au
magnitude: 0.44556 debye
