program: Orca
programVersion: 5.0.3
elementType: C H C H C C C H H C H H C C H H H H H H H
charge: 1
multiplicity: 1
keywords: PBE0 def2-TZVP EnGrad RIJCOSX verytightscf def2/J soscf
formula: C8H13
InChI: InChI=1/C8H13/c1-2-4-6-8-7-5-3-1/h1-2,7H,3-6,8H2
21 atoms
C  -1.995714 0.619816 0.080386
H  -2.173744 0.780445 1.150216
C  -1.801465 -0.951913 -0.171671
H  -2.642146 -1.457501 0.312543
C  -0.426537 -1.331167 0.363286
C  0.660328 -1.252599 -0.425011
C  1.959662 -0.703751 0.071182
H  2.139363 -0.941282 1.12474
H  2.826128 -1.034121 -0.511847
C  1.813858 0.841405 -0.110703
H  1.851199 1.099435 -1.175085
H  2.637603 1.368775 0.378356
C  0.464902 1.391504 0.506316
C  -0.711896 1.212663 -0.327357
H  0.521869 -1.236619 -1.509058
H  -1.859489 -1.145148 -1.247345
H  0.307196 1.028169 1.524064
H  -0.622986 1.555583 -1.363258
H  -2.838189 0.988864 -0.511719
H  0.61199 2.492117 0.546751
H  -0.314118 -1.387797 1.446669
totalener: -312.05172977 hartree
nucrepener: 379.76855867 hartree
electener: -691.82028844 hartree
oneelecener: -1160.59542170 hartree
twoeener: 468.77513326 hartree
kineticenergy: 310.15601744 hartree
exchangeener: -34.169035715379 hartree
correlationener: -1.961916461031 hartree
xcener: -36.130952176411 hartree
chargesum: 1.0000000
charge: -0.196922 0.179624 -0.217895 0.177395 -0.162469 -0.117037 -0.214921 0.159746 0.169751 -0.258479 0.160536 0.175869 -0.142770 0.042357 0.150679 0.171907 0.163614 0.206703 0.182987 0.206330 0.162996
charge: -0.195786 0.172283 -0.188336 0.157149 -0.124782 -0.139856 -0.225306 0.156428 0.162093 -0.197664 0.151700 0.157181 -0.214122 0.140670 0.158503 0.158528 0.165128 0.175696 0.166704 0.208477 0.155310
qa: -0.1969 0.1796 -0.2179 0.1774 -0.1625 -0.1170 -0.2149 0.1597 0.1698 -0.2585 0.1605 0.1759 -0.1428 0.0424 0.1507 0.1719 0.1636 0.2067 0.1830 0.2063 0.1630
va: 3.8983 0.9652 3.8964 0.9665 3.9426 3.9043 3.9338 0.9702 0.9703 3.9572 0.9668 0.9620 3.8898 3.6992 0.9658 0.9690 0.9786 0.9431 0.9670 0.9536 0.9640
energy: -312.051729770277
dipole: 0.41657 -0.92695 -0.51038 1.97624 -0.77043 1.20581 0.15445 -0.27768 -0.12323
magnitude: 1.31517 au
magnitude: 3.34289 debye
