program: Orca
programVersion: 5.0.3
elementType: C H C H C C C H H C H H C C H H H H H H H
charge: 1
multiplicity: 1
keywords: b3lyp cc-pVTZ EnGrad RIJCOSX verytightscf cc-pVTZ/C def2/J soscf
formula: C8H13
InChI: InChI=1/C8H13/c1-2-4-6-8-7-5-3-1/h1-2,7H,3-6,8H2
21 atoms
C  -1.999954 0.758677 0.069493
H  -2.16192 0.825414 1.147962
C  -1.729595 -0.970263 -0.160482
H  -2.618554 -1.321701 0.367442
C  -0.414653 -1.387444 0.3915
C  0.684885 -1.274566 -0.380274
C  2.000148 -0.693799 0.06263
H  2.20699 -0.894489 1.119373
H  2.855214 -1.035121 -0.527037
C  1.788205 0.852034 -0.138306
H  1.826617 1.114373 -1.201298
H  2.591997 1.401886 0.358331
C  0.422543 1.268476 0.492273
C  -0.76757 1.297759 -0.36945
H  0.519967 -1.197809 -1.459726
H  -1.832334 -1.12956 -1.234325
H  0.198856 0.633184 1.35394
H  -0.659432 1.608628 -1.412261
H  -2.883163 0.994632 -0.522369
H  0.48161 2.287544 0.93114
H  -0.332188 -1.482856 1.473527
totalener: -312.20883588 hartree
nucrepener: 379.37208242 hartree
electener: -691.58091830 hartree
oneelecener: -1159.79962202 hartree
twoeener: 468.21870371 hartree
kineticenergy: 309.98867597 hartree
exchangeener: -36.296235771168 hartree
correlationener: -2.303518838101 hartree
xcener: -38.599754609270 hartree
chargesum: 1.0000000
charge: -0.200806 0.170194 -0.186998 0.174587 -0.120632 -0.087874 -0.169332 0.126712 0.145296 -0.201142 0.131278 0.149644 -0.177401 0.106019 0.133324 0.163707 0.132322 0.202216 0.175578 0.186835 0.146472
charge: 0.135716 0.012247 0.177836 0.005981 0.023423 0.074846 0.078140 -0.005474 -0.004103 0.109178 -0.012860 -0.002050 0.082375 0.299470 -0.017884 -0.002496 0.006387 0.014606 0.004312 0.044493 -0.024142
qa: -0.2008 0.1702 -0.1870 0.1746 -0.1206 -0.0879 -0.1693 0.1267 0.1453 -0.2011 0.1313 0.1496 -0.1774 0.1060 0.1333 0.1637 0.1323 0.2022 0.1756 0.1868 0.1465
va: 3.8314 0.9811 3.8524 0.9723 3.7853 3.8031 3.8541 0.9935 0.9837 3.8424 0.9904 0.9810 3.8416 3.5438 0.9935 0.9810 1.0087 0.9717 0.9805 0.9725 0.9957
energy: -312.208835881169
dipole: 0.18134 -1.03631 -0.85498 1.68953 -0.58959 1.09994 0.36962 -0.48769 -0.11807
magnitude: 1.39814 au
magnitude: 3.55378 debye
