program: Gaussian 09
title: 000050914
version: EM64L-G09RevD.01
frameworkgroup: C1[X(C7H4Cl2O4)]
method: RPBEPBE
basis: SDD
operation: Freq
keyword: #p
keyword: freq=noraman
keyword: PBEPBE/SDD
title: #p freq=noraman PBEPBE/SDD
converged: NO YES NO NO
title: Mulliken charges:
elementType: Cl Cl O O O O C C C C C C C H H H H
charge: 0.010723 0.005752 -0.464673 -0.386432 -0.449672 -0.228242 0.399319 -0.485774 0.319177 0.297453 -0.337361 -0.268051 0.106862 0.310395 0.377611 0.400895 0.392017
chargesum: 0.00000
title: Mulliken charges with hydrogens summed into heavy atoms:
elementType: Cl Cl O O O O C C C C C C C
charge: 0.010723 0.005752 -0.087062 0.014463 -0.057655 -0.228242 0.399319 -0.485774 0.319177 0.297453 -0.026966 -0.268051 0.106862
polarizability: 1.65750848e+02 -2.67877005e-01 1.35421593e+02 -1.86808005e-02 -5.47227872e-03 4.09652023e+01
1716.lowfreq: -5.0541 -1.5028 -0.0027 -0.0014 0.0018 6.5666 41.1080 70.1474 126.1901
frequency: 41.0945 70.1468 126.1896 141.8562 158.1335 203.0891 242.8765 292.2184 296.2423 317.7974 330.7529 349.6433 372.5679 428.0739 466.4210 520.8131 530.1864 555.5393 592.1795 602.7818 603.4745 635.4361 722.9299 752.5044 764.0035 892.3992 904.4500 917.3578 1056.2335 1113.3926 1152.7328 1197.8907 1244.6374 1294.1820 1335.4573 1389.3873 1427.6909 1494.0100 1579.2038 1606.1770 1648.2466 3198.2073 3503.2545 3505.3192 3540.9202
redmass: 13.5475 13.5984 8.0818 9.8386 11.9021 17.7039 8.7385 8.1134 5.8528 9.6696 7.5604 12.1422 9.0341 1.1208 10.6035 1.1183 2.3921 4.6226 5.4364 6.4443 1.8195 6.0950 9.6321 5.8123 7.1219 9.1967 1.4539 9.6578 2.9786 2.6030 1.3716 2.1483 2.3496 1.5447 3.2522 7.5000 7.5482 4.9521 6.6076 9.0851 8.9986 1.0923 1.0649 1.0649 1.0643
irintensity: 1.3485 0.1564 0.4999 0.5544 1.2389 1.0165 7.1866 3.6815 4.9879 5.7847 2.4994 0.7710 7.2067 170.5948 11.6523 125.1413 74.1128 5.3518 33.1413 42.4361 100.5843 38.2781 19.1768 6.9657 46.7033 13.0742 16.3234 243.1225 251.5320 29.5421 95.3046 188.1441 313.4325 116.3166 2.9567 135.9223 101.3661 34.8897 18.3469 94.8847 277.8943 7.5540 105.7903 98.1831 59.3454
temp: 298.150 k
press: 1.00000 atm
elementType: 17 17 8 8 8 8 6 6 6 6 6 6 6 1 1 1 1
symmnumber: 1
zpe: 263884.8 jmol-1
zpe.correction: 0.100508 hartree
zpe.thermalcorrener: 0.112702 hartree
zpe.thermalcorrenthalpy: 0.113646 hartree
zpe.thermalcorrgfe: 0.061210 hartree
zpe.sumelectzpe: -1489.215956 hartree
zpe.sumelectthermal: -1489.203763 hartree
zpe.sumelectthermalent: -1489.202819 hartree
zpe.sumelectthermalfe: -1489.255255 hartree
dipole: 0.5005 1.2910 -0.0027
dipole: 1.3846
quadrupole: -100.7143 -70.0288 -88.6370
quadrupole: -4.8407 0.0193 -0.0267
quadrupole: -14.2543 16.4312 -2.1769 -4.8407 0.0193 -0.0267
hfenergy: -1489.3164649 hartree
pointgroup: C01 [X(C7H4Cl2O4)]
dipole: -0.0421534 -0.542559 -0.0244113 debye
dipolederiv: -0.1863982 0.1962549 0.0036792 0.237544 -0.5707799 -0.0188149 0.0055395 -0.0199136 -0.001688 -0.3028119 0.3009653 0.0059519 0.3578044 -0.4884425 -0.0110071 0.0084529 -0.0125691 -0.0261352 -0.4027717 -0.4013573 -0.0169886 -0.4251643 -1.1400005 -0.0455738 -0.0188572 -0.0454972 -0.409475 -1.4985224 -0.2892954 -0.0447019 -0.3397211 -0.1732194 -0.0006379 -0.0473772 0.0005786 -0.3758804 -0.5400414 -0.3757615 -0.0191127 -0.5775636 -1.1554317 -0.0468612 -0.0271288 -0.0406295 -0.4319952 -1.1140541 0.1958024 -0.0144864 0.1627753 -0.6442016 -0.0089845 -0.0147576 -0.0086784 -0.3139194 -1.003369 -0.0508468 -0.0318453 -0.1732121 -0.1645282 -0.0146227 -0.0375482 -0.0112246 0.0602865 0.4771535 -0.4960532 -0.0059662 -0.0954359 0.7351704 0.0346377 0.0117443 0.0231441 -0.0995771 -0.2969651 0.3353167 0.0046002 0.7878932 0.7876934 0.0551576 0.0249762 0.0422631 0.0697515 1.3595205 0.5044276 0.0581395 0.1685948 -0.0674785 -0.0034153 0.0432994 0.006594 0.1135825 0.1374404 0.1044588 0.0107721 0.0121932 -0.250904 -0.0075039 0.0068688 -0.0051609 -0.080119 0.2352112 -0.5989843 -0.0179177 -0.8272223 0.7029431 0.0133819 -0.0281345 0.0196751 -0.0989531 2.0500316 0.2861927 0.0635512 0.3504229 1.4220302 0.059605 0.0650162 0.0582383 0.2344956 0.1451251 0.0067405 -0.000381 -0.0039758 0.0646785 -0.0047638 -0.0008977 -0.0043654 0.168324 0.2884147 0.1541782 0.0031898 0.080934 0.3996921 0.0028905 0.000479 0.0054105 0.3892088 0.4822284 0.0674096 0.0053922 0.1325459 0.2033545 -0.0050215 0.0085526 -0.0067272 0.3987496 0.1698083 0.0605518 -0.0038764 0.1515875 0.3394241 0.0015337 -0.0002277 -0.0011378 0.4033438 unknown
polarizability: 160.1935051|-11.7920183|140.7161231|2.7993475|4.1310932|41.2280151 unknown
InChI: InChI=1S/C7H4Cl2O4/c8-3-1-2(7(12)13)4(9)6(11)5(3)10/h1,10-12H
charge 0 multiplicity 1
17 atoms
Cl 1.370726 -2.607411 -0.015841
Cl -2.357471 2.636766 0.116153
O  -1.644524 -2.446514 -0.094672
O  -3.215411 -0.271219 -0.040615
O  2.769305 1.844324 0.218425
O  3.371654 -0.393421 0.140141
C  0.997396 0.240964 0.101402
C  0.416795 -1.054846 0.026866
C  -0.979357 -1.218156 -0.020012
C  -1.847734 -0.091797 0.00633
C  0.117004 1.359642 0.127056
C  -1.273649 1.195029 0.080879
C  2.464048 0.469593 0.152348
H  0.552109 2.358787 0.183517
H  -0.994708 -3.198596 -0.107079
H  -3.416454 -1.244918 -0.089676
H  3.75807 1.941671 0.249679
