program: Gaussian 09
title: 000050928
version: EM64L-G09RevD.01
frameworkgroup: C1[X(C11H14O2S2)]
method: RPBEPBE
basis: SDD
operation: Freq
keyword: #p
keyword: freq=noraman
keyword: PBEPBE/SDD
title: #p freq=noraman PBEPBE/SDD
converged: YES YES NO NO
title: Mulliken charges:
elementType: S S O O C C C C C C C C C C C H H H H H H H H H H H H H H
charge: 0.205939 0.231498 -0.306890 -0.297506 -0.942451 0.655574 -0.621053 -0.631821 -0.447793 -0.458821 0.231314 0.182903 -0.330862 -0.530161 -0.530244 0.333323 0.275777 0.261348 0.272881 0.265946 0.276548 0.236069 0.251691 0.250736 0.226060 0.229646 0.257146 0.223856 0.229346
chargesum: 0.00000
title: Mulliken charges with hydrogens summed into heavy atoms:
elementType: S S O O C C C C C C C C C C C
charge: 0.205939 0.231498 -0.306890 -0.297506 -0.609128 0.655574 -0.083927 -0.092993 -0.171245 -0.222752 0.231314 0.182903 -0.079172 0.176281 0.180104
polarizability: 2.29747198e+02 1.03077792e+01 1.42773272e+02 2.55065292e+00 6.97899358e+00 1.17886199e+02
1716.lowfreq: -10.3691 -3.0653 -0.0026 -0.0018 -0.0003 6.7751 27.9998 38.2047 51.4508
frequency: 25.8243 38.1027 51.4021 85.3929 104.6680 119.8947 124.9183 157.0095 173.2150 184.3829 232.6941 240.4782 244.7227 282.4310 345.5934 376.4280 410.3689 427.0752 438.6634 481.8513 523.5317 560.6836 604.9472 623.7807 639.3314 664.4462 706.8677 717.2058 745.2339 751.3824 838.1272 855.3908 890.8258 902.3957 945.1336 950.7997 952.7323 983.5432 1003.9868 1090.5234 1103.0901 1112.2499 1115.2518 1135.3633 1141.8049 1152.5304 1156.3981 1162.9323 1191.5436 1218.0049 1243.9432 1261.3190 1276.1575 1291.2124 1372.1409 1404.3717 1422.0756 1429.6916 1441.0842 1443.3093 1457.0751 1460.2506 1477.3794 1481.8047 1488.2227 1571.0706 1610.9968 2971.4697 2974.0231 3022.6239 3030.7964 3064.9222 3067.2795 3071.1372 3094.8861 3113.0150 3120.5918 3122.5716 3131.2215 3161.9112 3165.3653
redmass: 5.8640 3.6062 4.5132 4.3166 3.0189 4.7394 3.9198 1.1781 1.2097 2.5916 2.6023 4.1924 4.6770 5.5816 4.4456 14.8023 4.9058 5.8237 3.5705 3.7292 6.2207 5.4143 5.8626 6.2069 3.7426 5.4302 4.2380 5.6336 5.1974 3.4097 1.5121 1.5845 4.6220 1.7418 3.9039 1.5277 1.6560 3.6568 2.3561 2.8025 1.0492 1.2448 1.2453 1.5965 1.3702 1.3156 1.4529 1.1036 1.8076 1.2235 2.7462 1.2449 2.2081 1.1945 5.8573 2.2436 1.1791 1.0841 1.1069 1.3877 1.0613 1.0735 1.1313 2.3903 1.0559 7.2358 6.7641 1.0306 1.0309 1.0551 1.0588 1.0872 1.1043 1.1041 1.1077 1.1085 1.1025 1.1030 1.0891 1.0926 1.0947
irintensity: 0.0342 3.5992 2.4569 2.5269 9.4153 0.0088 1.1097 0.2325 1.1138 7.5259 0.1064 8.5692 4.1778 4.7647 0.3160 0.8486 0.5880 3.5003 0.1197 11.6064 24.8092 3.1577 4.6379 3.2898 1.0362 14.7467 31.6590 11.4639 14.6898 3.0749 20.1085 10.6425 15.5252 21.3318 54.2705 12.7532 8.3529 44.7965 5.5777 71.4053 0.9291 17.1761 2.2087 3.2018 1.7011 0.6128 6.4382 4.0222 21.1646 2.9726 164.0245 4.7298 79.2838 7.4216 5.8561 28.8702 1.7562 13.1794 3.6128 23.5557 11.0127 11.5743 20.2270 101.2020 29.3628 8.6878 5.8958 78.4796 68.4536 16.3094 43.6944 8.1416 28.9689 22.7767 0.2809 19.2555 23.7140 25.3617 9.6152 5.9382 3.7902
temp: 298.150 k
press: 1.00000 atm
elementType: 16 16 8 8 6 6 6 6 6 6 6 6 6 6 6 1 1 1 1 1 1 1 1 1 1 1 1 1 1
symmnumber: 1
zpe: 593521.7 jmol-1
zpe.correction: 0.226060 hartree
zpe.thermalcorrener: 0.242087 hartree
zpe.thermalcorrenthalpy: 0.243031 hartree
zpe.thermalcorrgfe: 0.180997 hartree
zpe.sumelectzpe: -1372.964291 hartree
zpe.sumelectthermal: -1372.948265 hartree
zpe.sumelectthermalent: -1372.947320 hartree
zpe.sumelectthermalfe: -1373.009354 hartree
dipole: 0.5266 0.4705 0.4833
dipole: 0.8557
quadrupole: -82.9172 -97.3598 -109.4701
quadrupole: 0.1210 -0.6449 1.8790
quadrupole: 13.6652 -0.7774 -12.8878 0.1210 -0.6449 1.8790
hfenergy: -1373.1903512 hartree
pointgroup: C01 [X(C11H14O2S2)]
dipole: -0.2099201 -0.2013972 0.1694457 debye
polarizability: 230.1246727|8.6271618|143.6315625|-2.5407195|-3.9738026|116.6504332 unknown
InChI: InChI=1S/C11H14O2S2/c1-12-9-4-3-8(7-10(9)13-2)11-14-5-6-15-11/h3-4,7,11H,5-6H2,1-2H3
charge 0 multiplicity 1
29 atoms
S  -3.06334 -0.529987 -1.380807
S  -2.906227 0.602322 1.505973
O  1.960744 -1.795465 0.523797
O  3.54618 0.536053 -0.261118
C  -2.212682 0.795344 -0.257771
C  -0.706858 0.693628 -0.260972
C  -4.290456 -1.180763 -0.09011
C  -4.570845 -0.067135 0.92364
C  -0.048917 -0.499048 0.12951
C  0.069967 1.805312 -0.672177
C  1.354336 -0.579641 0.123837
C  2.133725 0.56091 -0.241315
C  1.480583 1.739496 -0.656052
C  2.721925 -2.476889 -0.549553
C  4.185885 0.276061 1.051095
H  -2.541327 1.770929 -0.64734
H  -3.855271 -2.06596 0.399488
H  -5.203203 -1.462912 -0.643046
H  -5.156295 0.751891 0.474816
H  -5.087801 -0.447329 1.821856
H  -0.625839 -1.382235 0.420233
H  -0.426612 2.729133 -0.990814
H  2.095497 2.595475 -0.951118
H  3.518876 -1.8224 -0.947238
H  2.039007 -2.77508 -1.367428
H  3.156128 -3.371802 -0.078379
H  3.83247 -0.677066 1.482972
H  3.96723 1.107522 1.747505
H  5.266118 0.233636 0.844917
