program: Orca
programVersion: 5.0.3
charge: 1
multiplicity: 1
keywords: DLPNO-CCSD(T1) tightPNO Extrapolate(3/4,def2) RIJK def2/JK verytightSCF miniprint nopop
formula: C8H13
InChI: InChI=1/C8H13/c1-2-4-6-8-7-5-3-1/h1-2,7H,3-6,8H2
21 atoms
C  -1.99451 0.517582 0.087598
H  -2.189923 0.763012 1.134798
C  -1.998643 -1.019236 -0.135973
H  -2.683229 -1.590202 0.492009
C  -0.54391 -1.087274 0.283739
C  0.579305 -1.064434 -0.524473
C  1.901018 -0.629277 0.031275
H  2.009346 -0.981426 1.062782
H  2.726904 -1.033987 -0.559314
C  1.934334 0.937602 0.008045
H  2.127688 1.280625 -1.014591
H  2.754668 1.300314 0.632796
C  0.570538 1.471941 0.485262
C  -0.497134 0.711295 -0.255389
H  0.485203 -1.270741 -1.589745
H  -2.147681 -1.286969 -1.185659
H  0.445422 1.379775 1.569502
H  -0.38151 0.801875 -1.338879
H  -2.655984 1.102567 -0.556763
H  0.472509 2.537071 0.233981
H  -0.373995 -1.036985 1.359903
e0: -310.329503142 hartree
corrType: DLPNO BASED
e0: -310.343116341 hartree
basis: def2-TZVPP def2-QZVPP
scfener: -310.329503142 -310.343116341
corrmethod: MDCI MDCI
correner: -1.452788750 -1.522900892
corrcbsextra: -1.574835774
energy: -311.919827179342
dipole: 0.55236 -0.70395 -0.15160 1.83929 -1.99815 -0.15886 0.22554 -0.43742 -0.21188
magnitude: 0.30514 au
magnitude: 0.77561 debye
