program: Orca
programVersion: 5.0.3
elementType: C H C H C C C H H C H H C C H H H H H H H
charge: 1
multiplicity: 1
keywords: b3lyp cc-pVTZ EnGrad D3BJ RIJCOSX verytightscf cc-pVTZ/C def2/J soscf
formula: C8H13
InChI: InChI=1/C8H13/c1-2-4-6-8-7-5-3-1/h1-2,7H,3-6,8H2
21 atoms
C  -2.00197 0.725193 0.080165
H  -2.204074 0.872898 1.144801
C  -1.760391 -0.93026 -0.144376
H  -2.618968 -1.362239 0.374648
C  -0.429274 -1.358053 0.408428
C  0.697374 -1.284624 -0.36437
C  2.008756 -0.687103 0.070293
H  2.222232 -0.879183 1.127246
H  2.859223 -1.021984 -0.527542
C  1.801429 0.896845 -0.144118
H  1.860356 1.132513 -1.211864
H  2.615363 1.424907 0.356605
C  0.424744 1.270473 0.439122
C  -0.743904 1.319491 -0.371155
H  0.530649 -1.20911 -1.443501
H  -1.850199 -1.127057 -1.214974
H  0.077693 0.204773 0.760008
H  -0.604998 1.347041 -1.456239
H  -2.869116 0.991844 -0.524981
H  0.367998 1.716631 1.440555
H  -0.347488 -1.517718 1.485737
totalener: -312.18177004 hartree
nucrepener: 381.28583886 hartree
electener: -693.46760890 hartree
oneelecener: -1163.37057101 hartree
twoeener: 469.90296210 hartree
kineticenergy: 309.94796479 hartree
exchangeener: -36.289819133584 hartree
correlationener: -2.306742176920 hartree
xcener: -38.596561310504 hartree
chargesum: 1.0000000
charge: -0.190789 0.154322 -0.211835 0.166807 -0.098708 -0.054609 -0.183789 0.135389 0.152968 -0.207772 0.138697 0.154275 -0.128066 0.064686 0.144805 0.152615 0.121975 0.174274 0.170445 0.184166 0.160146
charge: 0.119126 0.002874 0.136180 0.005097 0.051692 0.121843 0.091964 -0.004945 -0.002769 0.117300 -0.010075 -0.002293 0.099042 0.253909 -0.011315 -0.005148 0.007365 0.006651 0.005110 0.027856 -0.009465
qa: -0.1908 0.1543 -0.2118 0.1668 -0.0987 -0.0546 -0.1838 0.1354 0.1530 -0.2078 0.1387 0.1543 -0.1281 0.0647 0.1448 0.1526 0.1220 0.1743 0.1704 0.1842 0.1601
va: 3.8325 0.9863 3.8817 0.9773 3.7828 3.7868 3.8454 0.9911 0.9807 3.8667 0.9899 0.9838 3.7845 3.6430 0.9900 0.9856 1.0636 0.9821 0.9785 0.9864 0.9929
dispcorr: -0.037267673 hartree
energy: -312.219037711960
dipole: 0.03627 -0.49190 -0.45563 0.53777 0.02551 0.56328 0.29124 -0.31905 -0.02781
magnitude: 0.72502 au
magnitude: 1.84285 debye
