program: Gaussian 09
title: 000050970
version: EM64L-G09RevD.01
frameworkgroup: C1[X(C20H21FN2O)]
method: RPBEPBE
basis: SDD
operation: Freq
keyword: #p
keyword: freq=noraman
keyword: PBEPBE/SDD
title: #p freq=noraman PBEPBE/SDD
converged: YES YES NO NO
title: Mulliken charges:
elementType: F O N N C C C C C C C C C C C C C C C C C C C C H H H H H H H H H H H H H H H H H H H H H
charge: -0.202778 -0.227775 -0.104549 -0.492012 0.079784 0.148400 0.170004 -0.457524 0.204813 0.077195 -0.327370 -0.316818 0.324239 -0.340772 -0.377859 -0.291983 -0.682227 -0.678382 -0.213910 -0.386343 -0.306410 -0.382661 -0.391115 0.324026 0.227672 0.221572 0.326403 0.236034 0.177984 0.208494 0.175855 0.242271 0.235860 0.201554 0.197940 0.247824 0.207700 0.202010 0.236185 0.225330 0.228061 0.247654 0.287658 0.257278 0.260689
chargesum: 0.00000
title: Mulliken charges with hydrogens summed into heavy atoms:
elementType: F O N N C C C C C C C C C C C C C C C C C C C C
charge: -0.202778 -0.227775 -0.104549 -0.165609 0.079784 0.148400 0.170004 -0.008280 0.204813 0.077195 0.086648 0.067531 0.324239 -0.098501 -0.142000 -0.066653 -0.034909 -0.032486 0.014150 -0.138689 -0.018753 -0.125384 -0.130426 0.324026
polarizability: 3.21720165e+02 -4.34576899e+01 3.02021459e+02 -9.79926538e+00 -1.56608375e+01 1.40908516e+02
1716.lowfreq: -6.5207 -0.0009 -0.0007 -0.0005 1.3258 4.9403 19.7984 28.2799 32.5314
frequency: 19.4895 28.2385 32.5262 48.7693 49.3108 68.2205 77.8996 90.1777 103.2590 121.2599 153.6454 181.0099 191.8330 216.2462 230.6677 251.3456 265.5674 285.9140 294.6715 311.5033 316.8309 358.3927 364.6478 385.8845 408.7517 413.4099 434.8905 451.8677 471.4280 502.5929 531.2744 545.6666 578.0869 586.3054 601.4439 616.5518 632.5027 643.1081 699.7243 729.2815 740.1225 753.8347 763.3295 775.3161 780.6954 794.6915 799.9536 809.0363 829.0246 835.2752 851.6288 896.3224 911.9627 934.3840 940.0348 950.5485 952.3260 974.9881 985.9733 1003.7298 1008.3823 1023.9685 1053.0375 1075.1178 1085.0969 1096.2482 1107.6685 1107.8196 1120.2851 1158.0968 1160.4082 1170.8041 1198.5374 1206.9444 1221.1278 1250.4180 1252.1637 1267.5614 1284.9509 1294.7328 1297.1555 1304.8648 1326.1548 1342.2799 1367.4862 1369.3385 1372.8023 1382.2904 1386.8204 1401.1858 1410.3195 1418.8205 1444.8115 1457.5469 1461.0694 1463.9473 1470.3310 1475.9054 1478.1812 1483.2121 1483.4281 1489.7197 1528.7217 1567.3681 1586.5500 1589.7248 1611.6144 1629.4063 2803.2960 2832.6313 2856.3802 2981.0958 2982.9492 3013.8844 3036.0782 3057.7409 3072.5933 3078.1418 3094.1719 3101.0437 3130.3725 3132.3562 3140.7997 3162.2504 3173.0824 3176.4137 3188.1671 3208.6645 3584.0913
redmass: 4.9747 3.6581 3.2720 4.3898 5.0676 2.4845 3.6562 3.1786 3.7028 4.2838 5.5509 1.5803 2.4044 1.7001 4.4911 2.6340 5.0803 3.5065 2.1045 5.2290 3.5043 6.8328 3.3791 5.0056 4.5676 2.9779 2.9732 3.4319 2.7224 3.1717 7.5501 3.2401 3.8806 3.2424 1.2674 6.2603 5.2843 6.3252 4.4223 3.4308 3.0904 1.4994 3.8538 2.0773 5.5132 1.2154 1.7120 1.2691 2.8224 2.2843 1.4802 5.4317 2.0094 1.3897 1.3849 1.3595 4.2353 1.3701 2.0253 3.0469 2.3727 2.2725 3.1391 1.8710 2.4891 1.9389 1.3539 1.8649 1.8119 1.5493 1.8278 1.2350 2.0249 2.0099 2.2924 1.6442 1.4747 1.5924 1.4769 1.6571 1.2932 2.4183 2.0363 1.6844 3.9898 1.3692 1.3171 1.2659 1.2441 4.3155 4.8783 2.8772 1.4361 2.1170 1.0648 1.1190 1.0699 1.8615 1.3287 1.1102 2.4432 1.0800 4.7372 7.3333 6.4874 7.5019 6.4843 6.9719 1.0704 1.0722 1.0718 1.0361 1.0358 1.0829 1.0866 1.0924 1.0975 1.0934 1.1001 1.0999 1.0859 1.0896 1.0911 1.0977 1.0914 1.0954 1.0940 1.0953 1.0803
irintensity: 1.4156 0.0228 0.5895 0.4550 0.0175 0.5076 0.2745 1.3599 0.4848 0.5214 0.9593 3.2124 1.0460 1.7995 0.8313 3.2477 2.4285 0.3545 4.9979 5.6493 3.8761 0.9987 4.4943 0.4666 0.9840 0.3726 1.9504 3.5983 6.8642 15.5876 16.1001 3.8057 19.3025 4.1103 71.7387 5.0611 5.6645 1.4993 3.7309 4.7550 13.5756 93.7520 6.3660 15.2400 18.6888 5.7920 18.2733 2.6358 21.3172 54.4181 0.8687 6.8702 1.9139 1.7001 6.7065 2.1516 80.1613 0.8091 6.4841 12.8254 7.1008 12.6994 49.2344 17.9640 3.7322 7.2188 16.1096 22.7326 1.1261 70.5152 43.9296 14.4395 54.9374 34.7806 36.5070 3.2804 2.5519 4.4383 35.9742 4.1636 26.7326 3.7965 1.0504 23.5626 13.8894 5.0993 2.0451 24.6279 24.3268 48.3411 54.0211 78.0489 39.8430 44.0499 6.0818 6.2296 9.0732 69.0001 63.4492 27.0304 46.9714 6.1995 91.8975 42.5991 41.6326 24.1039 57.9145 1.3617 94.9949 78.6120 167.0827 43.2673 28.6069 19.6780 13.8323 8.0193 72.7426 64.4145 29.3038 34.2324 0.0719 8.5848 13.1833 31.6422 2.5533 4.8249 17.2588 1.3126 47.2004
temp: 298.150 k
press: 1.00000 atm
elementType: 9 8 7 7 6 6 6 6 6 6 6 6 6 6 6 6 6 6 6 6 6 6 6 6 1 1 1 1 1 1 1 1 1 1 1 1 1 1 1 1 1 1 1 1 1
symmnumber: 1
zpe: 951796.8 jmol-1
zpe.correction: 0.362520 hartree
zpe.thermalcorrener: 0.384963 hartree
zpe.thermalcorrenthalpy: 0.385907 hartree
zpe.thermalcorrgfe: 0.308728 hartree
zpe.sumelectzpe: -1057.566185 hartree
zpe.sumelectthermal: -1057.543742 hartree
zpe.sumelectthermalent: -1057.542798 hartree
zpe.sumelectthermalfe: -1057.619977 hartree
dipole: -0.6115 4.6065 -0.9121
dipole: 4.7355
quadrupole: -135.5627 -134.7019 -142.1594
quadrupole: 12.0145 -1.4899 -1.4524
quadrupole: 1.9120 2.7727 -4.6847 12.0145 -1.4899 -1.4524
hfenergy: -1057.9287051 hartree
pointgroup: C01 [X(C20H21F1N2O1)]
dipole: 0.9747782 -1.5167724 -0.4694496 debye
polarizability: 351.4921679|-19.4216983|269.8446672|-5.3790722|25.7088235|143.3133047 unknown
InChI: InChI=1S/C20H21FN2O/c1-3-23(4-2)13-18(24)19-16-7-5-6-8-17(16)22-20(19)14-9-11-15(21)12-10-14/h5-12,22H,3-4,13H2,1-2H3
charge 0 multiplicity 1
45 atoms
F  -6.319781 -0.308862 0.264947
O  -0.492353 1.693798 0.336177
N  1.867112 3.142145 -0.122074
N  -0.356224 -2.591636 -0.219876
C  0.488662 -0.478254 -0.023373
C  1.60269 -1.420543 -0.204266
C  -0.709618 -1.252594 -0.036441
C  1.899908 1.679636 -0.176065
C  1.031228 -2.735732 -0.31317
C  0.536655 0.997906 0.072171
C  1.117726 3.770595 -1.243721
C  3.205328 3.743594 0.10162
C  -2.154564 -0.940855 0.035565
C  3.021281 -1.32004 -0.279327
C  1.791459 -3.912112 -0.473991
C  3.793412 -2.487208 -0.443452
C  0.492925 5.121393 -0.848029
C  3.719387 3.571598 1.544786
C  3.191258 -3.773339 -0.539087
C  -3.048106 -1.636753 -0.831639
C  -2.696422 -0.02236 0.976249
C  -4.441641 -1.430267 -0.76689
C  -4.087124 0.187259 1.061096
C  -4.929317 -0.521515 0.187077
H  2.583057 1.314266 0.614948
H  2.307894 1.281624 -1.145024
H  -1.028403 -3.357615 -0.196149
H  0.300349 3.08756 -1.52765
H  1.772717 3.896348 -2.143875
H  3.117542 4.824627 -0.108838
H  3.964815 3.344087 -0.621019
H  3.531905 -0.357545 -0.213135
H  1.315582 -4.896123 -0.548382
H  -0.071414 5.550561 -1.697385
H  1.255868 5.862064 -0.544685
H  -0.196626 4.967566 -0.001236
H  4.687581 4.090941 1.673289
H  3.877039 2.510309 1.812483
H  2.989902 3.995703 2.256028
H  4.884267 -2.40293 -0.498673
H  3.821206 -4.660342 -0.664727
H  -2.650046 -2.310374 -1.59938
H  -2.023602 0.533387 1.629793
H  -5.131984 -1.944754 -1.441106
H  -4.512533 0.890083 1.782636
