program: Orca
programVersion: 5.0.3
elementType: C H C H C C C H H C H H C C H H H H H H H
charge: 1
multiplicity: 1
keywords: b3lyp def2-TZVP EnGrad RIJCOSX verytightscf def2/J soscf
formula: C8H13
InChI: InChI=1/C8H13/c1-2-4-6-8-7-5-3-1/h1-2,7H,3-6,8H2
21 atoms
C  -2.003199 0.725466 0.070792
H  -2.173225 0.800575 1.148134
C  -1.740125 -0.97366 -0.169576
H  -2.623358 -1.360735 0.344301
C  -0.41009 -1.378937 0.382924
C  0.677257 -1.268637 -0.395251
C  1.990107 -0.704986 0.064527
H  2.189141 -0.922851 1.119156
H  2.849569 -1.038464 -0.524481
C  1.791501 0.832851 -0.127461
H  1.824413 1.096032 -1.190613
H  2.598821 1.381793 0.364622
C  0.432079 1.317396 0.498304
C  -0.760669 1.281263 -0.346726
H  0.515122 -1.188464 -1.474748
H  -1.829013 -1.139445 -1.244594
H  0.241413 0.841983 1.463027
H  -0.657927 1.636292 -1.376427
H  -2.875389 0.995032 -0.524717
H  0.540349 2.406638 0.7030
H  -0.319842 -1.45788 1.465636
totalener: -312.21779707 hartree
nucrepener: 379.04578622 hartree
electener: -691.26358329 hartree
oneelecener: -1159.18982614 hartree
twoeener: 467.92624285 hartree
kineticenergy: 310.53030066 hartree
exchangeener: -36.318699266357 hartree
correlationener: -2.303034710931 hartree
xcener: -38.621733977288 hartree
chargesum: 1.0000000
charge: -0.226805 0.184716 -0.202539 0.180966 -0.168310 -0.071342 -0.202618 0.143904 0.154298 -0.249522 0.147283 0.160615 -0.124586 0.088269 0.123961 0.176271 0.148916 0.204504 0.181805 0.196397 0.153816
charge: -0.162078 0.171763 -0.123996 0.159748 -0.173474 -0.128206 -0.219709 0.151181 0.152640 -0.198412 0.146548 0.154072 -0.199827 0.107356 0.152147 0.154336 0.164398 0.173441 0.161030 0.207742 0.149300
qa: -0.2268 0.1847 -0.2025 0.1810 -0.1683 -0.0713 -0.2026 0.1439 0.1543 -0.2495 0.1473 0.1606 -0.1246 0.0883 0.1240 0.1763 0.1489 0.2045 0.1818 0.1964 0.1538
va: 3.8592 0.9600 3.8140 0.9588 3.8284 3.7971 3.8643 0.9711 0.9718 3.8943 0.9664 0.9645 3.7896 3.5737 0.9697 0.9610 0.9882 0.9467 0.9667 0.9524 0.9689
energy: -312.217797068815
dipole: 0.26227 -1.06685 -0.80458 1.91993 -0.66807 1.25185 0.25495 -0.38699 -0.13205
magnitude: 1.49396 au
magnitude: 3.79735 debye
