program: Orca
programVersion: 5.0.3
elementType: C H C H C C C H H C H H C C H H H H H H H
charge: 1
multiplicity: 1
keywords: m062x cc-pVTZ EnGrad RIJCOSX verytightscf cc-pVTZ/C def2/J soscf
formula: C8H13
InChI: InChI=1/C8H13/c1-2-4-6-8-7-5-3-1/h1-2,7H,3-6,8H2
21 atoms
C  -2.000402 0.665286 0.075265
H  -2.177089 0.790622 1.149009
C  -1.77105 -0.957061 -0.172032
H  -2.633378 -1.414958 0.321049
C  -0.414501 -1.356275 0.373214
C  0.668615 -1.262974 -0.410689
C  1.97453 -0.707507 0.068626
H  2.164633 -0.936558 1.12232
H  2.838866 -1.035896 -0.517959
C  1.80338 0.833374 -0.11873
H  1.837859 1.093353 -1.182621
H  2.616931 1.374363 0.372139
C  0.447325 1.360198 0.501511
C  -0.738475 1.250513 -0.333259
H  0.517028 -1.206496 -1.492595
H  -1.840151 -1.141676 -1.247374
H  0.27709 0.958173 1.502179
H  -0.646444 1.609744 -1.363284
H  -2.856904 0.989405 -0.519808
H  0.585134 2.460618 0.595653
H  -0.313847 -1.425008 1.456419
totalener: -312.27915642 hartree
nucrepener: 379.31530086 hartree
electener: -691.59445729 hartree
oneelecener: -1159.40166141 hartree
twoeener: 467.80720412 hartree
kineticenergy: 310.01671411 hartree
xcener: -23.082280049582 hartree
chargesum: 1.0000000
charge: -0.307272 0.218839 -0.285495 0.198131 -0.169186 -0.142611 -0.300540 0.184914 0.186083 -0.278030 0.181728 0.190501 -0.283829 0.108184 0.189912 0.198525 0.196129 0.271598 0.201091 0.231975 0.209355
charge: 0.112120 0.015397 0.129691 0.003157 0.040132 0.042631 0.068368 -0.001695 0.002366 0.111990 -0.008319 0.000564 0.080499 0.348150 -0.017627 -0.000622 0.007123 0.025736 0.009460 0.051866 -0.020988
qa: -0.3073 0.2188 -0.2855 0.1981 -0.1692 -0.1426 -0.3005 0.1849 0.1861 -0.2780 0.1817 0.1905 -0.2838 0.1082 0.1899 0.1985 0.1961 0.2716 0.2011 0.2320 0.2094
va: 3.7309 0.9454 3.7734 0.9528 3.6283 3.6513 3.7759 0.9605 0.9596 3.7253 0.9557 0.9525 3.7519 3.3039 0.9558 0.9534 0.9620 0.9155 0.9607 0.9440 0.9520
energy: -312.279156424489
dipole: 0.34627 -1.04133 -0.69507 1.98072 -0.59795 1.38277 0.18269 -0.32849 -0.14580
magnitude: 1.55449 au
magnitude: 3.95119 debye
