program: Orca
programVersion: 5.0.3
elementType: C H C H C C C H H C H H C C H H H H H H H
charge: 1
multiplicity: 1
keywords: DSD-PBEP86 def2-TZVP D3BJ RIJCOSX verytightscf def2-TZVP/C def2/J soscf noTRAH
formula: C8H13
InChI: InChI=1/C8H13/c1-2-4-6-8-7-5-3-1/h1-2,7H,3-6,8H2
21 atoms
C  -1.998767 0.525524 0.118465
H  -2.178536 0.72308 1.178676
C  -1.969336 -1.00203 -0.167266
H  -2.677316 -1.597734 0.410584
C  -0.526339 -1.118052 0.277344
C  0.605474 -1.108227 -0.508868
C  1.905639 -0.645901 0.061507
H  2.001664 -0.953406 1.108222
H  2.755885 -1.045709 -0.497441
C  1.905503 0.920209 -0.02838
H  2.04572 1.219935 -1.073456
H  2.749065 1.323242 0.538101
C  0.562716 1.480067 0.486259
C  -0.534508 0.785526 -0.25628
H  0.526942 -1.293588 -1.579635
H  -2.091709 -1.218247 -1.232496
H  0.44942 1.372167 1.570025
H  -0.415347 0.853643 -1.340697
H  -2.701321 1.107428 -0.485736
H  0.5067 2.555129 0.255659
H  -0.374313 -1.068002 1.35661
totalener: -311.15585031 hartree
nucrepener: 386.18376086 hartree
electener: -697.33961117 hartree
oneelecener: -1172.61558846 hartree
twoeener: 475.27597729 hartree
kineticenergy: 310.03646720 hartree
exchangeener: -13.676511795658 hartree
correlationener: -0.927245121980 hartree
xcener: -14.603756917639 hartree
chargesum: 1.0000000
charge: -0.197485 0.163262 -0.196160 0.177768 -0.076183 -0.051093 -0.222886 0.158641 0.176847 -0.236197 0.151777 0.172924 -0.206978 -0.037531 0.204960 0.158788 0.149172 0.177745 0.174409 0.178922 0.179300
charge: -0.188485 0.152642 -0.182939 0.149294 -0.061401 -0.010149 -0.203587 0.154923 0.157201 -0.206320 0.146224 0.150551 -0.223389 0.030354 0.165860 0.151832 0.150944 0.171721 0.150178 0.171708 0.172838
qa: -0.1975 0.1633 -0.1962 0.1778 -0.0762 -0.0511 -0.2229 0.1586 0.1768 -0.2362 0.1518 0.1729 -0.2070 -0.0375 0.2050 0.1588 0.1492 0.1777 0.1744 0.1789 0.1793
va: 3.8699 0.9743 3.8724 0.9723 3.8491 3.7929 3.9051 0.9684 0.9682 3.8755 0.9715 0.9674 3.9209 3.7265 0.9455 0.9741 0.9730 0.9581 0.9711 0.9663 0.9604
total: -311.830167733 hartree
dispcorr: -0.011514151 hartree
energy: -311.841681884252
dipole: 0.55932 -0.72263 -0.16331 1.85148 -1.82097 0.03051 0.19517 -0.38630 -0.19113
magnitude: 0.25324 au
magnitude: 0.64369 debye
