program: Orca
programVersion: 5.0.3
elementType: C H C H C C C H H C H H C C H H H H H H H
charge: 1
multiplicity: 1
keywords: DSD-PBEP86/2013 cc-pVTZ EnGrad RIJCOSX verytightscf cc-pVTZ/C def2/J soscf
formula: C8H13
InChI: InChI=1/C8H13/c1-2-4-6-8-7-5-3-1/h1-2,7H,3-6,8H2
21 atoms
C  -2.001526 0.683085 0.073948
H  -2.177148 0.792327 1.148996
C  -1.760842 -0.962024 -0.172013
H  -2.630623 -1.398729 0.32691
C  -0.412113 -1.363819 0.375976
C  0.670936 -1.265213 -0.406151
C  1.979287 -0.707771 0.067492
H  2.171943 -0.934104 1.121385
H  2.842533 -1.037132 -0.519618
C  1.799836 0.831751 -0.121115
H  1.83386 1.092782 -1.184755
H  2.610917 1.375829 0.37035
C  0.4425 1.349196 0.500277
C  -0.746418 1.261009 -0.335913
H  0.515765 -1.198539 -1.487283
H  -1.835842 -1.1413 -1.247283
H  0.267383 0.932158 1.493932
H  -0.651414 1.620099 -1.365599
H  -2.862765 0.990204 -0.522123
H  0.573359 2.448711 0.61797
H  -0.315027 -1.434675 1.45913
totalener: -311.14167775 hartree
nucrepener: 379.19106155 hartree
electener: -690.33273930 hartree
oneelecener: -1158.79893072 hartree
twoeener: 468.46619142 hartree
kineticenergy: 309.72044216 hartree
exchangeener: -12.752215298857 hartree
correlationener: -0.942567321980 hartree
xcener: -13.694782620837 hartree
chargesum: 1.0000000
charge: -0.252689 0.196541 -0.243094 0.192434 -0.165757 -0.148117 -0.237144 0.162286 0.177776 -0.252617 0.160091 0.181264 -0.241355 0.097196 0.170854 0.182456 0.172546 0.243334 0.198463 0.214834 0.190696
charge: 0.118086 0.014862 0.141552 0.003431 0.037151 0.045472 0.069229 -0.002898 0.001116 0.111102 -0.009364 -0.000441 0.081875 0.339960 -0.018114 -0.001440 0.006491 0.024039 0.008558 0.051100 -0.021766
qa: -0.2527 0.1965 -0.2431 0.1924 -0.1658 -0.1481 -0.2371 0.1623 0.1778 -0.2526 0.1601 0.1813 -0.2414 0.0972 0.1709 0.1825 0.1725 0.2433 0.1985 0.2148 0.1907
va: 3.8718 0.9731 3.9121 0.9688 3.8215 3.8486 3.9027 0.9858 0.9765 3.8860 0.9825 0.9723 3.9200 3.5179 0.9813 0.9763 0.9887 0.9499 0.9748 0.9647 0.9789
energy: -311.841158729362
dipole: 0.32115 -1.07323 -0.75208 1.97318 -0.62689 1.34629 0.19851 -0.33966 -0.14115
magnitude: 1.54856 au
magnitude: 3.93614 debye
