program: Orca
programVersion: 5.0.3
elementType: C H C H C C C H H C H H C C H H H H H H H
charge: 1
multiplicity: 1
keywords: DSD-PBEP86/2013 cc-pVTZ EnGrad D3BJ RIJCOSX verytightscf cc-pVTZ/C def2/J soscf
formula: C8H13
InChI: InChI=1/C8H13/c1-2-4-6-8-7-5-3-1/h1-2,7H,3-6,8H2
21 atoms
C  -1.989877 0.568099 0.099874
H  -2.166297 0.749085 1.16538
C  -1.860284 -0.969373 -0.174461
H  -2.660134 -1.518588 0.329438
C  -0.459964 -1.273075 0.333337
C  0.638794 -1.214945 -0.458033
C  1.930479 -0.686771 0.072617
H  2.077843 -0.945965 1.126291
H  2.799183 -1.037349 -0.494116
C  1.838028 0.866011 -0.085633
H  1.893797 1.130156 -1.148282
H  2.682343 1.35371 0.409874
C  0.506549 1.447677 0.511249
C  -0.649356 1.093641 -0.311965
H  0.529211 -1.292174 -1.540712
H  -1.929303 -1.166154 -1.24923
H  0.366758 1.18061 1.562028
H  -0.534625 1.303635 -1.379935
H  -2.797854 1.016853 -0.488902
H  0.616548 2.548419 0.449715
H  -0.32815 -1.274555 1.416789
totalener: -311.14839822 hartree
nucrepener: 381.20114468 hartree
electener: -692.34954290 hartree
oneelecener: -1162.77043234 hartree
twoeener: 470.42088944 hartree
kineticenergy: 309.72464170 hartree
exchangeener: -14.120565844418 hartree
correlationener: -0.943935879750 hartree
xcener: -15.064501724168 hartree
chargesum: 1.0000000
charge: -0.225028 0.176691 -0.226375 0.181307 -0.119150 -0.141274 -0.239142 0.163331 0.179689 -0.244192 0.156459 0.181466 -0.231334 0.033386 0.203891 0.165411 0.171821 0.228740 0.185646 0.209235 0.189422
charge: 0.089391 0.005714 0.091999 -0.000306 0.103184 0.083729 0.072168 -0.001367 0.005437 0.107515 -0.007500 -0.000527 0.070214 0.336172 -0.011954 -0.000001 0.003343 0.014026 0.008671 0.039627 -0.009533
qa: -0.2250 0.1767 -0.2264 0.1813 -0.1192 -0.1413 -0.2391 0.1633 0.1797 -0.2442 0.1565 0.1815 -0.2313 0.0334 0.2039 0.1654 0.1718 0.2287 0.1856 0.2092 0.1894
va: 3.8568 0.9809 3.8970 0.9750 3.8302 3.8386 3.9097 0.9854 0.9770 3.8823 0.9832 0.9724 3.9078 3.5849 0.9708 0.9859 0.9843 0.9581 0.9760 0.9655 0.9802
dispcorr: -0.014264965 hartree
energy: -311.834269689558
dipole: 0.51473 -0.90047 -0.38574 1.91691 -1.08037 0.83655 0.14818 -0.28160 -0.13342
magnitude: 0.93081 au
magnitude: 2.36594 debye
