program: Orca
programVersion: 5.0.3
elementType: C H C H C C C H H C H H C C H H H H H H H
charge: 1
multiplicity: 1
keywords: PBE0 cc-pVTZ EnGrad RIJCOSX verytightscf cc-pVTZ/C def2/J soscf
formula: C8H13
InChI: InChI=1/C8H13/c1-2-4-6-8-7-5-3-1/h1-2,7H,3-6,8H2
21 atoms
C  -1.989939 0.57279 0.096949
H  -2.166617 0.752518 1.162881
C  -1.85255 -0.966916 -0.174153
H  -2.658048 -1.511689 0.325871
C  -0.455361 -1.281549 0.337813
C  0.641479 -1.221012 -0.453543
C  1.933735 -0.689382 0.072674
H  2.085648 -0.945368 1.126455
H  2.802412 -1.036866 -0.496237
C  1.834507 0.862359 -0.089582
H  1.886697 1.125003 -1.152714
H  2.676675 1.355782 0.403933
C  0.501286 1.44152 0.511509
C  -0.657904 1.11266 -0.314573
H  0.528324 -1.286841 -1.536845
H  -1.918695 -1.163609 -1.249135
H  0.359683 1.160518 1.558262
H  -0.547856 1.344767 -1.378617
H  -2.803331 1.010979 -0.492061
H  0.61964 2.542482 0.463805
H  -0.325756 -1.290532 1.42142
totalener: -312.05707892 hartree
nucrepener: 380.94976886 hartree
electener: -693.00684778 hartree
oneelecener: -1162.88333719 hartree
twoeener: 469.87648941 hartree
kineticenergy: 309.63458618 hartree
exchangeener: -34.152900764722 hartree
correlationener: -1.963550723135 hartree
xcener: -36.116451487857 hartree
chargesum: 1.0000000
charge: -0.160667 0.153853 -0.168343 0.152725 -0.105869 -0.126001 -0.173051 0.140872 0.154113 -0.196869 0.138386 0.153972 -0.171214 0.029667 0.174668 0.144522 0.149551 0.202684 0.160619 0.183897 0.162484
charge: 0.089041 0.007438 0.091579 0.000304 0.100681 0.079103 0.072206 0.000194 0.007365 0.108836 -0.005839 0.000675 0.070430 0.327485 -0.011526 0.001434 0.004717 0.013638 0.009923 0.042265 -0.009948
qa: -0.1607 0.1539 -0.1683 0.1527 -0.1059 -0.1260 -0.1731 0.1409 0.1541 -0.1969 0.1384 0.1540 -0.1712 0.0297 0.1747 0.1445 0.1496 0.2027 0.1606 0.1839 0.1625
va: 3.8364 0.9907 3.8804 0.9868 3.8237 3.8323 3.8869 0.9939 0.9878 3.8660 0.9903 0.9852 3.8848 3.5994 0.9851 0.9940 0.9935 0.9733 0.9868 0.9783 0.9934
energy: -312.057078915397
dipole: 0.50484 -0.86772 -0.36288 1.92579 -1.05816 0.86763 0.14695 -0.26946 -0.12251
magnitude: 0.94840 au
magnitude: 2.41065 debye
