program: Gaussian 09
title: 000050934
version: EM64L-G09RevD.01
frameworkgroup: C1[X(C13H20N2O4)]
method: RPBEPBE
basis: SDD
operation: Freq
keyword: #p
keyword: freq=noraman
keyword: PBEPBE/SDD
title: #p freq=noraman PBEPBE/SDD
converged: YES YES NO NO
title: Mulliken charges:
elementType: O O O O N N C C C C C C C C C C C C C H H H H H H H H H H H H H H H H H H H H
charge: -0.165510 -0.178995 -0.367400 -0.156137 -0.151890 -0.075810 -0.387063 -0.394467 -0.381480 -0.390551 -0.342848 -0.496093 -0.363247 0.246303 -0.697371 -0.178541 -0.298091 0.136955 0.197902 0.187419 0.198066 0.206297 0.196983 0.207774 0.191535 0.224014 0.220668 0.182491 0.177376 0.249317 0.225449 0.188923 0.228953 0.211305 0.203961 0.215996 0.270930 0.258501 0.398377
chargesum: 0.00000
title: Mulliken charges with hydrogens summed into heavy atoms:
elementType: O O O O N N C C C C C C C C C C C C C
charge: -0.165510 -0.178995 0.030976 -0.156137 -0.151890 -0.075810 -0.001579 0.008813 0.017829 0.054131 0.017018 -0.021327 0.054628 0.246303 -0.066109 0.092389 -0.039589 0.136955 0.197902
polarizability: 2.08587975e+02 1.30974833e+01 1.65900225e+02 -3.69338447e-01 1.00203456e-02 1.29053561e+02
1716.lowfreq: -14.2242 -0.0004 -0.0003 0.0005 6.7669 8.7866 12.4292 15.1819 33.1055
frequency: 10.3027 14.5849 32.7811 41.0372 62.6353 66.2106 71.2565 82.0887 94.0859 98.5825 117.1832 127.1251 179.8487 194.4497 207.4766 228.6913 236.0067 286.5279 310.5823 329.9989 347.4100 365.7671 404.0134 412.0974 465.6036 484.4549 489.8732 594.6354 612.9850 623.5165 662.7565 695.4678 701.5241 714.2465 730.2789 736.9440 747.2571 759.2396 804.5287 805.4254 835.9568 852.3207 869.8806 873.0663 901.0937 945.6716 966.2360 1001.3830 1012.1201 1026.6127 1036.2665 1043.8049 1068.0169 1085.1094 1100.0144 1106.7213 1116.2293 1123.7834 1144.9674 1161.2716 1196.0469 1210.1487 1224.3317 1231.0583 1248.9998 1261.6861 1276.6899 1284.6868 1292.8240 1297.8468 1315.2789 1322.4322 1342.7210 1347.2657 1347.3784 1353.8982 1357.3764 1389.1730 1457.2265 1460.8328 1464.7926 1465.8390 1468.9487 1475.0406 1477.8260 1478.0966 1483.6574 1490.9826 1516.6825 1639.6180 1704.2157 2945.6965 2953.5724 2962.0953 2964.9480 2969.9999 2971.0776 2985.6286 2989.4735 2996.1533 3000.1817 3019.1518 3025.1414 3037.1791 3043.3150 3066.4928 3070.1147 3076.9776 3234.8600 3268.1393 3439.2816
redmass: 4.8317 5.6726 3.8576 5.3857 4.7113 3.2784 7.2486 4.3047 2.3477 3.8730 2.5029 1.9463 7.0719 2.3284 2.7570 1.2038 3.8699 4.4839 2.3151 5.3995 4.2635 4.8793 4.5748 2.6931 8.0456 9.3929 2.4504 3.8399 6.3323 1.1376 5.4100 2.7927 1.6527 1.2004 1.1357 4.2622 8.9147 1.2503 11.8482 1.4261 1.3934 1.7612 2.2529 4.1866 1.8969 1.4773 2.0081 2.3871 1.9346 2.4668 5.0033 2.7259 2.1589 2.1468 2.3667 2.3890 1.7647 2.5041 1.9957 1.9821 1.6024 2.1275 1.7596 1.4289 1.3061 1.3486 1.3182 1.0870 1.1535 1.2427 1.3773 2.5677 1.4722 1.4180 2.0098 1.5587 1.5206 1.2162 1.1398 1.1143 1.0966 3.1465 1.0792 1.0543 1.0884 1.0546 1.0837 1.0962 8.6469 12.8080 9.9185 1.0591 1.0609 1.0599 1.0627 1.0380 1.0604 1.0918 1.0647 1.0672 1.0945 1.0984 1.1003 1.1033 1.1002 1.1008 1.0991 1.0994 1.0925 1.1088 1.0647
irintensity: 0.6051 0.3330 0.0348 1.5729 0.2124 0.2667 1.2509 4.3560 0.2423 1.1298 0.6850 0.1392 9.8026 0.8525 0.8358 0.1171 1.8491 2.1806 1.6815 24.5382 11.4640 7.4333 7.9063 0.6798 29.0624 16.2621 1.3016 1.4609 6.8928 131.3332 2.0546 49.8569 30.8002 15.0680 6.4204 25.2701 1.8361 0.6331 1.9585 5.2571 7.8048 2.6128 1.6311 5.1764 3.2135 8.4677 1.5639 92.7683 10.7160 83.3834 231.9027 16.9297 9.1837 16.6575 19.7678 6.5900 2.0259 6.9903 6.9957 4.2940 3.3221 70.0741 235.6412 3.4732 2.2149 5.0047 3.8288 0.2095 0.6731 4.1678 1.8433 5.6541 0.5341 4.4941 2.8982 0.5953 1.0887 12.5516 3.4937 10.3679 0.3979 0.1428 1.3503 0.9112 15.4685 13.7635 3.0366 24.9733 27.1882 140.5888 182.4216 11.4416 7.2618 29.6885 36.0918 72.6548 45.6823 9.0142 2.1167 35.0580 7.3118 29.3419 24.1036 132.3106 26.0139 99.1377 54.9327 29.4434 5.3336 1.1648 62.0931
temp: 298.150 k
press: 1.00000 atm
elementType: 8 8 8 8 7 7 6 6 6 6 6 6 6 6 6 6 6 6 6 1 1 1 1 1 1 1 1 1 1 1 1 1 1 1 1 1 1 1 1
symmnumber: 1
zpe: 832140.9 jmol-1
zpe.correction: 0.316946 hartree
zpe.thermalcorrener: 0.337864 hartree
zpe.thermalcorrenthalpy: 0.338808 hartree
zpe.thermalcorrgfe: 0.262830 hartree
zpe.sumelectzpe: -916.236473 hartree
zpe.sumelectthermal: -916.215555 hartree
zpe.sumelectthermalent: -916.214611 hartree
zpe.sumelectthermalfe: -916.290589 hartree
dipole: 0.4827 -0.9255 0.6548
dipole: 1.2322
quadrupole: -125.4952 -109.8456 -115.7614
quadrupole: -13.9195 -8.0052 -1.8616
quadrupole: -8.4611 7.1885 1.2727 -13.9195 -8.0052 -1.8616
hfenergy: -916.5534186 hartree
pointgroup: C01 [X(C13H20N2O4)]
dipole: -0.2187438 -0.3534121 -0.2495175 debye
polarizability: 206.108909|-16.4675827|168.3535247|0.3344544|-1.039252|129.0793275 unknown
InChI: InChI=1S/C13H20N2O4/c1-2-3-4-5-6-7-8-11-14-9-10-15(11)19-13(18)12(16)17/h9-10,16H,2-8H2,1H3
charge 0 multiplicity 1
39 atoms
O  -1.10117 -0.82837 0.741849
O  -1.37539 -2.037899 -1.275411
O  0.988602 -3.349211 -0.833408
O  1.34908 -2.082485 1.068257
N  -2.334979 -0.12655 0.44608
N  -3.73438 1.437292 -0.267997
C  1.919469 2.41006 -0.800013
C  0.793545 3.322419 -0.248441
C  2.598113 1.51967 0.26703
C  -0.445315 2.58011 0.311397
C  3.760965 0.672338 -0.298602
C  -1.258427 1.840947 -0.79135
C  4.445497 -0.21166 0.768724
C  -2.432029 1.087521 -0.246825
C  5.599993 -1.061582 0.195675
C  -3.598292 -0.562428 0.87559
C  -4.453573 0.434388 0.41577
C  -0.728391 -1.749803 -0.252294
C  0.643542 -2.387314 0.099398
H  1.529176 1.770673 -1.619733
H  2.693229 3.052871 -1.267833
H  1.217022 3.953324 0.559252
H  0.462336 4.018975 -1.046351
H  1.857246 0.839505 0.734091
H  2.981297 2.165424 1.085062
H  -1.119104 3.306507 0.804684
H  -0.135106 1.858665 1.090998
H  4.515327 1.343476 -0.761608
H  3.381166 0.024421 -1.117785
H  -1.654301 2.574818 -1.514797
H  -0.59407 1.156744 -1.353495
H  4.830104 0.436214 1.58326
H  3.687494 -0.877303 1.227157
H  5.23333 -1.744917 -0.59368
H  6.384887 -0.421509 -0.251015
H  6.073685 -1.679849 0.980313
H  -3.738737 -1.4814 1.435568
H  -5.5327 0.49961 0.52778
H  0.288962 -3.426091 -1.543896
