program: Orca
programVersion: 5.0.3
elementType: C H C H C C C H H C H H C C H H H H H H H
charge: 1
multiplicity: 1
keywords: DSD-PBEP86/2013 cc-pVTZ EnGrad D3BJ RIJCOSX verytightscf cc-pVTZ/C def2/J soscf
formula: C8H13
InChI: InChI=1/C8H13/c1-2-4-6-8-7-5-3-1/h1-2,7H,3-6,8H2
21 atoms
C  -1.997337 0.757331 0.071798
H  -2.167639 0.84189 1.14797
C  -1.733191 -0.958497 -0.154131
H  -2.618429 -1.316644 0.375989
C  -0.420172 -1.383194 0.395913
C  0.688589 -1.279648 -0.373114
C  2.003315 -0.689343 0.063908
H  2.213385 -0.882647 1.121545
H  2.856885 -1.0320 -0.526581
C  1.791758 0.869113 -0.143279
H  1.83982 1.124452 -1.20731
H  2.596901 1.413803 0.356302
C  0.42177 1.254446 0.479802
C  -0.76655 1.307345 -0.378189
H  0.52484 -1.208354 -1.453094
H  -1.837481 -1.123369 -1.226995
H  0.168956 0.487078 1.224729
H  -0.655465 1.541149 -1.441054
H  -2.879794 0.986557 -0.524294
H  0.442005 2.149562 1.126315
H  -0.340147 -1.49567 1.477219
totalener: -311.11207967 hartree
nucrepener: 379.77163764 hartree
electener: -690.88371731 hartree
oneelecener: -1159.93011319 hartree
twoeener: 469.04639589 hartree
kineticenergy: 309.72490205 hartree
exchangeener: -14.116781269405 hartree
correlationener: -0.943210636589 hartree
xcener: -15.059991905994 hartree
chargesum: 1.0000000
charge: -0.260679 0.198121 -0.242278 0.200269 -0.147166 -0.124335 -0.235073 0.155531 0.173990 -0.259645 0.159673 0.177825 -0.246203 0.106034 0.164357 0.190378 0.151628 0.228375 0.203065 0.222542 0.183592
charge: 0.131507 0.013364 0.172337 0.008496 0.019561 0.073011 0.077551 -0.005325 -0.004067 0.105958 -0.013061 -0.001976 0.076564 0.312401 -0.017390 -0.000748 0.009154 0.016967 0.007004 0.039065 -0.020374
qa: -0.2607 0.1981 -0.2423 0.2003 -0.1472 -0.1243 -0.2351 0.1555 0.1740 -0.2596 0.1597 0.1778 -0.2462 0.1060 0.1644 0.1904 0.1516 0.2284 0.2031 0.2225 0.1836
va: 3.8859 0.9716 3.9116 0.9653 3.8253 3.8422 3.9055 0.9871 0.9769 3.8897 0.9845 0.9759 3.8814 3.5571 0.9832 0.9723 1.0108 0.9603 0.9713 0.9619 0.9828
dispcorr: -0.014269176 hartree
energy: -311.801742867332
dipole: 0.13460 -1.04774 -0.91313 1.39094 -0.33329 1.05764 0.42216 -0.52852 -0.10636
magnitude: 1.40133 au
magnitude: 3.56190 debye
