program: Orca
programVersion: 5.0.3
elementType: C H C H C C C H H C H H C C H H H H H H H
charge: 1
multiplicity: 1
keywords: PBE0 cc-pVTZ EnGrad RIJCOSX verytightscf cc-pVTZ/C def2/J soscf
formula: C8H13
InChI: InChI=1/C8H13/c1-2-4-6-8-7-5-3-1/h1-2,7H,3-6,8H2
21 atoms
C  -1.997926 0.759291 0.070889
H  -2.164458 0.836829 1.148079
C  -1.731325 -0.96264 -0.156072
H  -2.618362 -1.316235 0.373912
C  -0.418395 -1.385261 0.39445
C  0.687402 -1.27807 -0.375163
C  2.002441 -0.690367 0.06334
H  2.211622 -0.88548 1.120773
H  2.856399 -1.033097 -0.52671
C  1.790388 0.863746 -0.142016
H  1.835403 1.121821 -1.205643
H  2.594731 1.410501 0.356915
C  0.421701 1.256836 0.484816
C  -0.767445 1.304256 -0.376313
H  0.523296 -1.205301 -1.454993
H  -1.835898 -1.124823 -1.229258
H  0.178846 0.532003 1.269922
H  -0.657747 1.565464 -1.432495
H  -2.881311 0.988865 -0.523431
H  0.4551 2.202285 1.062891
H  -0.337896 -1.491473 1.476051
totalener: -312.02812284 hartree
nucrepener: 379.62611325 hartree
electener: -691.65423610 hartree
oneelecener: -1160.25899508 hartree
twoeener: 468.60475898 hartree
kineticenergy: 309.64407706 hartree
exchangeener: -34.146027116674 hartree
correlationener: -1.961312880968 hartree
xcener: -36.107339997642 hartree
chargesum: 1.0000000
charge: -0.204025 0.175614 -0.183327 0.174276 -0.142559 -0.095330 -0.172653 0.133298 0.146606 -0.199823 0.137030 0.150703 -0.205006 0.112036 0.140311 0.168162 0.142083 0.198434 0.178827 0.190645 0.154699
charge: 0.130520 0.014124 0.171157 0.008721 0.018217 0.075446 0.075852 -0.003407 -0.002702 0.105916 -0.011085 -0.000256 0.077393 0.299390 -0.015085 -0.000153 0.009983 0.015411 0.006826 0.044362 -0.020631
qa: -0.2040 0.1756 -0.1833 0.1743 -0.1426 -0.0953 -0.1727 0.1333 0.1466 -0.1998 0.1370 0.1507 -0.2050 0.1120 0.1403 0.1682 0.1421 0.1984 0.1788 0.1906 0.1547
va: 3.8610 0.9815 3.8854 0.9776 3.8190 3.8289 3.8852 0.9951 0.9882 3.8708 0.9933 0.9866 3.8768 3.5741 0.9941 0.9826 1.0154 0.9766 0.9825 0.9771 0.9958
energy: -312.028122841739
dipole: 0.14952 -1.00042 -0.85090 1.49943 -0.44074 1.05869 0.40836 -0.50991 -0.10155
magnitude: 1.36205 au
magnitude: 3.46206 debye
