program: Gaussian 09
title: 000050922
version: EM64L-G09RevD.01
frameworkgroup: C1[X(C13H19N3O2)]
method: RPBEPBE
basis: SDD
operation: Freq
keyword: #p
keyword: freq=noraman
keyword: PBEPBE/SDD
title: #p freq=noraman PBEPBE/SDD
converged: YES YES NO NO
title: Mulliken charges:
elementType: O O N N N C C C C C C C C C C C C C H H H H H H H H H H H H H H H H H H H
charge: -0.324168 -0.266111 -0.504400 -0.170781 -0.444625 0.427610 0.496658 0.491038 -0.438840 -0.318256 -0.449101 -0.360278 -0.641050 -0.642396 0.130137 -0.353145 -0.778185 -0.484958 0.293051 0.221871 0.266213 0.223184 0.301484 0.358892 0.227662 0.265571 0.216474 0.221215 0.213857 0.251341 0.229346 0.229786 0.225269 0.224803 0.235820 0.212294 0.212716
chargesum: 0.00000
title: Mulliken charges with hydrogens summed into heavy atoms:
elementType: O O N N N C C C C C C C C C C C C C
charge: -0.324168 -0.266111 -0.211349 -0.170781 -0.085732 0.427610 0.496658 0.491038 -0.216970 -0.052043 -0.225917 -0.058794 0.068657 0.044018 0.130137 0.105988 -0.328113 0.175872
polarizability: 2.93066942e+02 1.46141351e+01 1.68438533e+02 1.51712482e+01 -1.66621785e-01 1.12711931e+02
1716.lowfreq: -15.3544 -5.0085 -0.0009 -0.0008 -0.0002 1.4086 20.6870 40.0432 50.2069
frequency: 20.6780 40.0241 50.2040 59.1627 65.4155 82.7602 88.6700 104.4448 110.4417 134.6287 179.6305 198.2550 207.1308 226.9844 248.0137 258.8379 292.1420 316.9999 355.9577 373.5853 388.3192 408.8180 417.1929 455.9291 491.1195 509.9731 522.8501 582.4355 599.7020 612.9534 641.0204 657.3437 684.4164 720.9525 739.1356 769.1196 785.1145 813.5184 827.4258 844.1254 857.6962 912.5054 928.0567 944.9372 975.2470 987.7977 1000.2054 1002.6459 1006.8928 1057.4670 1065.6990 1095.0854 1117.8414 1124.8504 1138.5209 1147.5288 1187.1237 1188.4485 1210.3636 1221.2324 1242.2657 1260.4471 1283.0195 1303.9455 1341.0682 1355.5965 1387.1536 1399.3463 1424.0251 1428.1734 1433.9978 1448.6441 1456.2345 1458.7669 1462.0865 1465.2057 1474.4761 1477.9492 1482.4800 1505.6886 1512.0868 1534.2623 1593.5093 1619.1160 1634.2131 1636.5416 2915.2031 2931.0584 2941.0800 2953.0387 3006.3901 3022.2055 3025.1479 3026.6113 3084.9916 3108.3606 3111.3226 3122.0782 3129.9190 3132.4026 3166.0034 3188.4948 3237.8387 3441.4736 3558.8641
redmass: 4.4547 3.7298 3.4351 2.8474 3.3400 3.9477 3.6399 2.6129 2.5772 1.7027 4.5638 2.7345 1.2051 1.6265 3.0653 2.2719 3.3697 3.3874 3.4704 4.5388 2.8630 3.0529 3.3486 5.5192 1.9240 1.7884 2.4524 3.4438 4.0181 4.4061 5.8092 1.1817 4.7897 3.7479 3.6488 1.1631 1.3570 1.5027 3.4056 4.5789 1.5142 5.3600 1.3798 5.5622 2.3596 1.3167 1.8060 2.5829 1.8300 1.3953 7.1290 1.2365 1.2639 1.3387 1.3958 1.5388 1.0823 1.1215 2.6591 2.9834 3.5889 1.7806 2.7065 1.4848 1.3841 2.4147 3.0625 1.8319 1.2769 2.0633 1.1459 1.3399 1.0826 1.0522 1.2042 1.2220 1.0714 1.0744 1.0773 1.1766 2.6788 2.2637 4.7147 6.2485 4.7065 6.4166 1.0494 1.0490 1.0349 1.0535 1.1053 1.1038 1.0843 1.0865 1.1007 1.0867 1.0987 1.0951 1.0609 1.0968 1.0894 1.0956 1.1149 1.0763 1.0758
irintensity: 2.5314 0.3531 2.1639 5.0644 4.2038 2.5358 2.0103 6.0384 2.9227 0.6789 2.0842 4.1972 5.6392 10.3752 1.6036 14.9929 0.3693 0.6615 6.1199 10.2836 3.6541 0.1361 4.8224 0.8366 68.8030 105.3981 2.9772 0.4640 8.3872 14.7351 1.3539 18.1711 2.1636 1.6316 1.3218 27.5629 111.5486 84.7402 10.7478 2.4582 58.1718 22.9498 2.3428 13.0087 7.7217 3.4755 0.5397 0.6096 48.5985 16.1234 170.5791 5.4143 0.0026 10.0441 11.5750 13.3798 4.9629 9.9447 37.3959 3.0915 19.8487 46.8889 58.4744 37.8603 4.2907 16.8135 259.2172 21.4538 9.2457 14.2020 15.3627 92.2304 23.4316 13.7225 28.5646 33.2133 23.6544 7.5489 11.5002 36.8233 304.6436 534.8437 62.6381 274.4416 294.4936 43.2394 84.2127 142.5402 79.6305 59.0863 39.9716 55.1888 61.2954 6.5614 19.4049 22.3057 23.1496 11.0532 0.2585 19.9856 2.5763 3.5066 19.3546 108.0401 20.3034
temp: 298.150 k
press: 1.00000 atm
elementType: 8 8 7 7 7 6 6 6 6 6 6 6 6 6 6 6 6 6 1 1 1 1 1 1 1 1 1 1 1 1 1 1 1 1 1 1 1
symmnumber: 1
zpe: 800172.3 jmol-1
zpe.correction: 0.304770 hartree
zpe.thermalcorrener: 0.324251 hartree
zpe.thermalcorrenthalpy: 0.325195 hartree
zpe.thermalcorrgfe: 0.255239 hartree
zpe.sumelectzpe: -820.088670 hartree
zpe.sumelectthermal: -820.069189 hartree
zpe.sumelectthermalent: -820.068245 hartree
zpe.sumelectthermalfe: -820.138201 hartree
dipole: 1.9124 -2.3771 1.9430
dipole: 3.6171
quadrupole: -71.5069 -105.7681 -111.2112
quadrupole: -10.9361 -1.1713 1.6133
quadrupole: 24.6551 -9.6060 -15.0492 -10.9361 -1.1713 1.6133
hfenergy: -820.3934399 hartree
pointgroup: C01 [X(C13H19N3O2)]
dipole: 0.7116849 0.5291722 -1.1129239 debye
polarizability: 295.4833848|-8.0849924|153.6140452|-4.2754295|-23.6778313|125.1199758 unknown
InChI: InChI=1S/C13H19N3O2/c1-10(16(2)3)14-11-5-7-12(8-6-11)15-13(17)9-18-4/h5-8,14-15H,1,9H2,2-4H3
charge 0 multiplicity 1
37 atoms
O  5.202281 0.685021 -0.425739
O  2.993186 -1.478224 1.497291
N  -2.961534 0.880938 -0.609378
N  -3.956469 -1.224136 -0.033856
N  2.675926 0.279615 -0.056263
C  -1.569708 0.681305 -0.436073
C  1.259465 0.379724 -0.152523
C  -4.032117 0.181416 0.020833
C  -0.67036 1.504807 -1.171915
C  -1.023227 -0.294873 0.441933
C  0.719832 1.359898 -1.02691
C  0.369708 -0.448354 0.581357
C  -3.472654 -1.913759 -1.243227
C  -4.862257 -2.00782 0.81102
C  3.430205 -0.58311 0.708846
C  4.945069 -0.384876 0.541212
C  -5.053286 0.88125 0.621278
C  6.625606 0.947199 -0.63349
H  -3.234306 1.770101 -1.028767
H  -1.065804 2.263149 -1.859419
H  -1.698213 -0.933095 1.017962
H  1.392034 2.010419 -1.600857
H  0.781259 -1.1988 1.259641
H  3.242315 0.924347 -0.624112
H  -2.857804 -2.79027 -0.96537
H  -2.852137 -1.232577 -1.843162
H  -4.317812 -2.264973 -1.875427
H  -4.468152 -3.035386 0.911266
H  -5.893454 -2.074766 0.395439
H  -4.925009 -1.550759 1.813643
H  5.376182 -0.136981 1.534188
H  5.386434 -1.34499 0.200326
H  -5.978273 0.396123 0.93811
H  -4.949397 1.950889 0.818416
H  6.686487 1.756744 -1.377019
H  7.146194 0.047992 -1.022556
H  7.11509 1.271913 0.307801
