program: Gaussian 09
title: 000050943
version: EM64L-G09RevD.01
frameworkgroup: C1[X(C14H21NO4)]
method: RPBEPBE
basis: SDD
operation: Freq
keyword: #p
keyword: freq=noraman
keyword: PBEPBE/SDD
title: #p freq=noraman PBEPBE/SDD
converged: YES YES NO NO
title: Mulliken charges:
elementType: O O O O N C C C C C C C C C C C C C C H H H H H H H H H H H H H H H H H H H H H
charge: -0.308538 -0.282662 -0.302923 -0.281150 -0.385507 -0.337303 -0.396782 -0.351242 0.390552 0.144272 -0.685886 -0.516317 -0.565251 0.279439 0.235000 0.056645 -0.524820 -0.497981 -0.526766 0.193536 0.228659 0.204925 0.254871 0.188369 0.199843 0.308634 0.208763 0.215075 0.214820 0.240507 0.296481 0.230446 0.246034 0.225557 0.228903 0.251496 0.206191 0.271658 0.212968 0.229485
chargesum: 0.00000
title: Mulliken charges with hydrogens summed into heavy atoms:
elementType: O O O O N C C C C C C C C C C C C C C
charge: -0.308538 -0.282662 -0.302923 -0.281150 -0.076874 0.084892 0.063013 0.036970 0.390552 0.144272 -0.047228 -0.275810 -0.268769 0.279439 0.235000 0.056645 0.177217 0.188610 0.187345
polarizability: 2.43581597e+02 -7.58556798e-02 1.81164249e+02 1.64925042e+01 2.81257095e+00 1.22913876e+02
1716.lowfreq: -8.6679 -4.0148 -0.0007 -0.0006 -0.0005 1.2886 12.6531 25.8459 31.3506
frequency: 11.2257 25.8090 31.3144 41.1366 61.0895 74.4384 85.5752 98.4589 114.1319 125.2283 144.3263 154.7066 161.0926 174.9483 197.9921 218.0105 223.8121 232.6699 247.5071 260.1379 285.4236 296.8221 331.2492 343.6652 356.6926 399.3077 432.6895 485.8831 499.3142 517.1111 545.5363 581.1487 615.7550 643.6389 658.8453 728.9402 739.6717 745.7511 761.2586 819.8656 846.0475 867.9482 872.9105 881.0993 919.6066 937.6335 944.8448 970.9030 993.1305 1042.4817 1045.9195 1070.5502 1107.9937 1109.1482 1111.2008 1112.2832 1120.8344 1135.2918 1147.7762 1151.7038 1156.9310 1175.0200 1202.5554 1228.0283 1243.1166 1265.1431 1288.1236 1301.3672 1312.4965 1349.2057 1364.8446 1368.9346 1390.9167 1392.3121 1414.2659 1435.0841 1441.1850 1443.9190 1450.7322 1453.4958 1458.4375 1459.7249 1460.9915 1469.8434 1473.3607 1476.5879 1477.1474 1485.8877 1486.9777 1497.2843 1561.8864 1598.2303 1606.5409 2959.0076 2969.8547 2971.6523 2974.0255 2977.8505 2978.4983 2992.8905 3006.3716 3046.1723 3066.9582 3071.2996 3073.5937 3075.3533 3076.5599 3089.0188 3120.3264 3123.3696 3127.1581 3148.6868 3177.0386 3566.9866
redmass: 3.8978 4.2372 3.0669 5.1976 3.4140 1.6809 3.2556 3.0967 3.6477 2.8334 1.5553 1.6563 1.1646 1.4717 2.6386 3.0760 2.6364 1.2955 3.4740 4.3903 4.0242 2.9963 4.6615 5.0091 4.6559 3.9712 5.9275 5.2221 2.0135 5.7504 1.5590 3.9637 4.0401 4.6780 5.6429 1.8791 4.3103 1.6618 4.5867 2.0998 2.0595 7.5825 1.6391 2.6514 1.5284 7.1937 2.2395 1.6781 4.0706 3.7195 4.6482 2.1215 1.5674 1.3872 1.4697 1.3729 2.2665 1.8880 1.3773 1.3850 1.4878 3.1366 1.6006 1.3261 1.7044 1.4428 1.1082 3.8704 1.3171 1.4839 3.8581 1.5765 1.2177 3.0685 1.2951 1.2824 1.2625 1.2710 1.3345 1.0888 1.1611 1.0769 1.2490 1.0515 1.0677 1.0581 1.0426 1.0767 1.0547 2.1042 7.4782 7.7523 6.6965 1.0593 1.0320 1.0313 1.0372 1.0604 1.0353 1.0652 1.0975 1.1005 1.1045 1.1004 1.0996 1.1006 1.1003 1.0966 1.1024 1.1042 1.1056 1.0908 1.0923 1.0773
irintensity: 0.1475 1.5383 2.9494 9.2721 0.9280 0.3134 6.7724 0.6100 2.9361 3.7030 2.1225 3.2703 0.0586 0.8739 5.0200 0.2319 3.4746 0.5227 8.8772 1.1947 9.6577 12.3467 1.4632 2.1620 2.4743 26.1766 2.3354 0.5994 20.2459 7.8406 75.9800 5.6712 6.6154 21.5808 15.5123 7.4064 22.5781 15.9611 4.8238 6.2123 6.3267 15.9142 18.5101 5.4875 17.8185 80.0115 17.5608 13.5789 50.9191 49.3489 130.4504 13.5145 8.3289 5.3662 5.7032 3.8617 5.4499 1.4627 2.4173 6.0353 28.7626 52.6371 14.9623 4.0597 12.1771 18.1805 2.7691 270.6203 106.4081 0.9620 35.4064 37.8494 7.6600 46.2354 12.8841 18.5931 7.0801 74.7935 87.2389 14.9084 52.1321 12.0547 48.4488 21.8085 3.9987 14.5568 11.7253 13.9717 28.7950 193.8035 213.5736 55.9019 0.1454 28.5636 101.5811 47.8601 28.1374 71.8229 60.4259 47.1972 8.3174 44.1206 27.7006 79.5045 39.5482 24.4465 21.9777 43.0679 26.0438 16.8830 20.2640 4.9894 3.9071 10.5543
temp: 298.150 k
press: 1.00000 atm
elementType: 8 8 8 8 7 6 6 6 6 6 6 6 6 6 6 6 6 6 6 1 1 1 1 1 1 1 1 1 1 1 1 1 1 1 1 1 1 1 1 1
symmnumber: 1
zpe: 865167.7 jmol-1
zpe.correction: 0.329525 hartree
zpe.thermalcorrener: 0.351473 hartree
zpe.thermalcorrenthalpy: 0.352417 hartree
zpe.thermalcorrgfe: 0.275585 hartree
zpe.sumelectzpe: -900.222595 hartree
zpe.sumelectthermal: -900.200647 hartree
zpe.sumelectthermalent: -900.199703 hartree
zpe.sumelectthermalfe: -900.276535 hartree
dipole: 2.2552 3.0205 2.1101
dipole: 4.3199
quadrupole: -87.5590 -113.5946 -118.5973
quadrupole: -4.7644 -1.7778 -10.6665
quadrupole: 19.0247 -7.0110 -12.0137 -4.7644 -1.7778 -10.6665
hfenergy: -900.55212 hartree
pointgroup: C01 [X(C14H21N1O4)]
dipole: 0.8954622 -1.0899854 -0.9479988 debye
polarizability: 244.48187|0.6795062|179.4696397|-12.6575865|10.3520032|123.7082121 unknown
InChI: InChI=1S/C14H21NO4/c1-5-6-7-15-14(16)10-8-11(17-2)13(19-4)12(9-10)18-3/h8-9,15H,5-7H2,1-4H3
charge 0 multiplicity 1
40 atoms
O  2.733357 2.259229 0.315151
O  1.827987 -2.573953 -0.482951
O  3.725155 -0.278158 -0.545118
O  -2.083398 1.421365 1.825258
N  -2.686044 -0.543135 0.737289
C  -4.963365 0.324106 0.06122
C  -4.107959 -0.430046 1.108092
C  -5.040226 -0.379096 -1.312632
C  -0.329033 0.171506 0.695711
C  -1.754386 0.404013 1.13423
C  -5.931695 0.380783 -2.318804
C  0.16051 -1.090666 0.292176
C  0.545718 1.284948 0.710467
C  1.879034 1.1280 0.303657
C  1.512557 -1.266316 -0.095589
C  2.393143 -0.144431 -0.091915
C  3.086809 2.761529 -1.033141
C  3.217346 -3.06468 -0.463071
C  4.769644 0.016026 0.468152
H  -5.987459 0.436109 0.473016
H  -4.555058 1.346008 -0.058612
H  -4.509596 -1.450423 1.263524
H  -4.143943 0.110394 2.069728
H  -5.430285 -1.409651 -1.17699
H  -4.019375 -0.478273 -1.734368
H  -2.406311 -1.277846 0.087463
H  -6.96575 0.477248 -1.93736
H  -5.977188 -0.138615 -3.293623
H  -5.543967 1.401428 -2.496105
H  -0.456268 -1.995152 0.316069
H  0.177484 2.262086 1.034225
H  3.753526 3.620362 -0.861676
H  3.604519 1.98124 -1.6207
H  2.175436 3.093568 -1.565471
H  3.124771 -4.145828 -0.650563
H  3.824516 -2.58064 -1.24322
H  3.682933 -2.897659 0.52715
H  4.626069 1.02545 0.889374
H  4.73775 -0.741352 1.275318
H  5.726743 -0.048876 -0.071661
