program: Orca
programVersion: 5.0.3
elementType: C H C H C C C H H C H H C C H H H H H H H
charge: 1
multiplicity: 1
keywords: PBE0 cc-pVTZ EnGrad RIJCOSX verytightscf cc-pVTZ/C def2/J soscf
formula: C8H13
InChI: InChI=1/C8H13/c1-2-4-6-8-7-5-3-1/h1-2,7H,3-6,8H2
21 atoms
C  -1.989877 0.568099 0.099874
H  -2.166297 0.749085 1.16538
C  -1.860284 -0.969373 -0.174461
H  -2.660134 -1.518588 0.329438
C  -0.459964 -1.273075 0.333337
C  0.638794 -1.214945 -0.458033
C  1.930479 -0.686771 0.072617
H  2.077843 -0.945965 1.126291
H  2.799183 -1.037349 -0.494116
C  1.838028 0.866011 -0.085633
H  1.893797 1.130156 -1.148282
H  2.682343 1.35371 0.409874
C  0.506549 1.447677 0.511249
C  -0.649356 1.093641 -0.311965
H  0.529211 -1.292174 -1.540712
H  -1.929303 -1.166154 -1.24923
H  0.366758 1.18061 1.562028
H  -0.534625 1.303635 -1.379935
H  -2.797854 1.016853 -0.488902
H  0.616548 2.548419 0.449715
H  -0.32815 -1.274555 1.416789
totalener: -312.05882487 hartree
nucrepener: 381.20114468 hartree
electener: -693.25996955 hartree
oneelecener: -1163.37898527 hartree
twoeener: 470.11901572 hartree
kineticenergy: 309.63511410 hartree
exchangeener: -34.153596401882 hartree
correlationener: -1.964061885559 hartree
xcener: -36.117658287441 hartree
chargesum: 1.0000000
charge: -0.160625 0.152910 -0.167400 0.152857 -0.101396 -0.123383 -0.173893 0.140841 0.154264 -0.197263 0.138250 0.153955 -0.170300 0.022766 0.177045 0.144233 0.149301 0.201521 0.160107 0.183313 0.162898
charge: 0.088386 0.006560 0.091052 0.000247 0.104176 0.083910 0.072442 0.000329 0.007391 0.107552 -0.005668 0.000675 0.069683 0.323014 -0.010819 0.001473 0.004457 0.012745 0.009659 0.041348 -0.008612
qa: -0.1606 0.1529 -0.1674 0.1529 -0.1014 -0.1234 -0.1739 0.1408 0.1543 -0.1973 0.1382 0.1540 -0.1703 0.0228 0.1770 0.1442 0.1493 0.2015 0.1601 0.1833 0.1629
va: 3.8376 0.9911 3.8788 0.9870 3.8226 3.8309 3.8880 0.9939 0.9878 3.8668 0.9902 0.9852 3.8839 3.6091 0.9844 0.9943 0.9933 0.9739 0.9867 0.9784 0.9934
energy: -312.058824865655
dipole: 0.51473 -0.86140 -0.34667 1.91691 -1.10515 0.81176 0.14818 -0.27088 -0.12270
magnitude: 0.89117 au
magnitude: 2.26518 debye
