program: Gaussian 09
title: 000050979
version: EM64L-G09RevD.01
frameworkgroup: C1[X(C20H24N2O3)]
method: RPBEPBE
basis: SDD
operation: Freq
keyword: #p
keyword: freq=noraman
keyword: PBEPBE/SDD
title: #p freq=noraman PBEPBE/SDD
converged: NO YES NO NO
title: Mulliken charges:
elementType: O O O N N C C C C C C C C C C C C C C C C C C C C H H H H H H H H H H H H H H H H H H H H H H H H
charge: -0.441232 -0.485834 -0.254837 -0.026630 -0.016247 -0.122777 -0.019225 -0.526141 -0.115119 -0.484928 -0.399224 -0.489511 -0.331233 -0.078569 0.364275 -0.619654 0.239783 -0.360957 -0.083376 -0.556321 -0.389472 -0.315172 0.283291 -0.361055 -0.538246 0.237942 0.300539 0.265351 0.225689 0.221968 0.276900 0.265244 0.255787 0.288257 0.228596 0.224143 0.298967 0.230201 0.354512 0.220192 0.220968 0.258069 0.331105 0.234267 0.257414 0.244751 0.221061 0.248318 0.218171
chargesum: 0.00000
title: Mulliken charges with hydrogens summed into heavy atoms:
elementType: O O O N N C C C C C C C C C C C C C C C C C C C C
charge: -0.441232 -0.131322 -0.254837 -0.026630 -0.016247 0.115165 0.281314 -0.035100 0.106849 0.057217 0.144820 -0.036772 -0.032266 0.151631 0.364275 -0.178494 0.239783 -0.102888 -0.083376 -0.225217 -0.155206 -0.057758 0.283291 -0.116305 0.149304
polarizability: 2.87698622e+02 -8.52931316e+00 2.81346855e+02 -1.29445555e+01 -8.35766872e+00 1.84269742e+02
1716.lowfreq: -14.8326 -14.4211 -0.0005 0.0002 0.0003 2.3133 17.4361 28.5705 37.0336
frequency: 15.9377 27.8989 36.7717 60.9463 70.6444 75.2818 107.0860 124.9338 146.2836 179.1986 195.4622 201.5298 210.0320 236.1065 241.9629 249.5987 270.8757 302.7977 310.2204 317.8375 331.2453 335.2861 351.5821 368.4619 375.4435 414.7231 430.4126 453.3559 481.6904 498.5343 512.4807 530.7111 539.0797 543.5429 551.3772 582.5138 620.9636 638.1005 662.3895 672.7626 691.2738 695.9917 759.7309 774.1739 795.8486 800.7471 804.0058 830.1252 846.5565 866.7919 875.1422 881.2257 896.5815 914.0243 923.4113 939.2574 945.8297 949.2901 953.1777 963.0400 967.0450 973.7534 998.5306 999.6733 1007.5465 1008.1979 1009.4899 1035.8284 1040.7243 1069.0727 1074.6400 1095.5918 1110.5201 1113.8674 1135.0319 1149.0175 1159.9891 1164.1499 1195.9996 1200.7857 1205.4390 1219.7267 1227.3470 1243.9636 1249.9885 1259.4857 1264.0771 1279.7348 1291.8972 1294.0152 1298.6780 1304.1307 1315.1457 1320.9955 1322.8785 1334.4519 1341.7679 1351.3976 1365.0796 1365.6821 1384.8240 1399.5130 1427.7246 1430.2201 1435.7232 1454.5469 1467.0193 1468.9114 1469.1862 1472.8958 1473.6074 1488.7378 1508.5392 1548.1135 1580.3068 1627.5778 1655.4212 2888.7938 2958.2883 2991.4382 3004.3846 3008.9066 3038.2559 3041.2489 3045.0901 3046.3665 3056.4612 3059.4517 3068.3449 3071.5345 3077.8546 3090.0703 3114.0542 3118.9667 3124.8933 3133.0420 3150.8742 3158.8982 3172.6532 3195.6267 3574.7896
redmass: 4.4200 4.2528 4.7454 3.6030 3.5082 3.5454 4.2616 3.3601 4.9667 4.2148 2.7638 3.2619 2.2997 2.6904 1.7083 2.6472 3.6611 3.2205 2.1875 1.6122 3.6761 3.0927 2.5892 5.3402 3.3680 3.6747 4.0868 4.3690 4.1134 3.7912 5.9639 6.4569 3.4394 3.9801 4.7357 4.7005 4.7063 3.6265 2.4284 2.6114 4.8108 4.6584 3.9784 3.0026 3.3666 1.5639 2.1813 1.9601 3.5382 2.3126 4.7687 1.8114 4.2692 3.0444 1.8477 2.6025 1.3737 1.7577 2.0678 1.3887 1.3629 1.6920 2.2902 1.9859 2.5875 2.6241 2.1754 2.7069 2.7458 2.3285 2.2466 2.0563 1.2571 1.7397 1.3571 1.3959 1.3311 1.5073 1.5213 1.4310 2.0146 1.2715 2.1088 1.4229 2.2677 1.3214 1.8085 1.4533 1.3098 1.5046 1.4089 1.2412 1.5322 2.2618 1.4395 1.3523 1.3516 1.4203 1.4329 2.0052 1.9574 2.1058 1.9313 1.2023 1.6871 2.4329 1.0788 1.0850 1.0514 1.0804 1.0763 1.0857 3.4248 6.5989 6.8052 6.2304 4.6939 1.0820 1.0331 1.0849 1.0616 1.0619 1.0725 1.0732 1.0856 1.1040 1.0618 1.1017 1.0963 1.0809 1.1014 1.0728 1.1061 1.0893 1.0991 1.1069 1.0869 1.0939 1.0970 1.1143 1.0660
irintensity: 0.6752 1.0413 3.6132 0.1845 2.9984 1.0604 3.9839 0.5502 1.7991 1.8492 2.0923 3.8304 2.6048 4.6890 2.3535 18.9701 12.4080 1.9607 19.3308 93.2171 2.1048 13.8769 14.1760 3.5517 1.9243 18.1336 2.9373 0.5735 7.2594 18.0803 11.2158 3.9395 1.7382 2.6199 10.0660 1.5419 8.2293 8.3816 5.3773 9.3897 2.7612 11.4363 12.9189 5.0672 7.1249 4.7561 32.6254 17.4610 0.2289 25.5366 24.4268 8.6787 5.8883 3.8377 10.5963 30.4399 89.5535 7.5039 8.5812 3.1574 4.9273 7.9929 44.8831 7.8998 6.6006 30.1130 1.1823 4.2830 12.1520 19.5393 33.2065 17.7923 0.2249 1.9516 6.9925 5.5430 7.6627 3.9691 43.8552 25.6507 108.6898 10.0766 0.9610 55.1859 81.6615 2.8559 31.4967 1.9272 0.0301 30.0758 22.8274 1.8810 3.0858 16.2014 2.3971 1.5185 1.5626 0.1496 5.6953 15.0093 0.4657 2.5300 8.5119 5.8359 8.8147 28.8444 14.7760 6.7428 12.9416 31.9362 24.7653 10.1570 101.1136 31.8823 28.0252 98.3211 22.9424 94.5629 92.3704 15.8801 29.4467 19.0487 38.6421 19.4164 4.9655 48.3665 16.5633 17.8863 67.1422 23.3072 13.4574 5.8788 11.5334 28.7497 21.8449 4.5006 3.6683 12.0604 17.4366 24.9605 16.7612
temp: 298.150 k
press: 1.00000 atm
elementType: 8 8 8 7 7 6 6 6 6 6 6 6 6 6 6 6 6 6 6 6 6 6 6 6 6 1 1 1 1 1 1 1 1 1 1 1 1 1 1 1 1 1 1 1 1 1 1 1 1
symmnumber: 1
zpe: 1060075.5 jmol-1
zpe.correction: 0.403761 hartree
zpe.thermalcorrener: 0.426168 hartree
zpe.thermalcorrenthalpy: 0.427112 hartree
zpe.thermalcorrgfe: 0.351639 hartree
zpe.sumelectzpe: -1109.741905 hartree
zpe.sumelectthermal: -1109.719499 hartree
zpe.sumelectthermalent: -1109.718555 hartree
zpe.sumelectthermalfe: -1109.794027 hartree
dipole: 2.8442 0.6230 1.2810
dipole: 3.1810
quadrupole: -132.3851 -138.3467 -152.2402
quadrupole: -16.4745 3.2588 11.5249
quadrupole: 8.6056 2.6439 -11.2495 -16.4745 3.2588 11.5249
hfenergy: -1110.1456668 hartree
pointgroup: C01 [X(C20H24N2O3)]
dipole: -1.123591 -0.1785242 0.5214251 debye
polarizability: 287.4922311|-5.3443252|280.395365|16.6885864|-10.7545809|185.4276235 unknown
InChI: InChI=1S/C20H24N2O3/c1-3-13-12-22(24)9-7-14(13)10-19(22)20(23)16-6-8-21-18-5-4-15(25-2)11-17(16)18/h3-6,8,11,13-14,19-20,23H,1,7,9-10,12H2,2H3
charge 0 multiplicity 1
49 atoms
O  -0.942612 -1.520924 -1.703399
O  -0.826981 2.153484 -1.998936
O  2.936713 -2.913439 -0.004345
N  -1.865352 -0.728081 -0.964765
N  3.441807 2.638301 0.817168
C  -3.568459 0.706282 0.408126
C  -1.137697 0.472249 -0.249339
C  -2.19315 1.425927 0.369783
C  -3.379567 -0.688049 1.098117
C  -2.519555 -1.572308 0.134917
C  -2.969519 -0.190227 -1.88404
C  -4.070828 0.526452 -1.049626
C  -0.13317 1.092039 -1.241086
C  -4.684467 -1.37045 1.447786
C  1.10535 1.612808 -0.52644
C  -5.067321 -1.719533 2.700774
C  2.129539 0.695581 -0.068246
C  1.28703 2.980582 -0.298332
C  3.284452 1.272621 0.600031
C  2.057946 -0.720623 -0.249395
C  2.461364 3.446582 0.373378
C  4.32204 0.405322 1.058711
C  3.099504 -1.538047 0.21774
C  4.242563 -0.976082 0.876667
C  4.003525 -3.815868 0.434602
H  -4.293172 1.306349 0.986958
H  -0.550426 -0.041079 0.531289
H  -2.267771 2.342992 -0.238885
H  -1.879173 1.716094 1.388598
H  -2.817289 -0.519577 2.0378
H  -1.690134 -2.089664 0.641242
H  -3.118423 -2.330128 -0.396794
H  -3.327859 -1.074014 -2.434393
H  -2.462099 0.488522 -2.584072
H  -4.282507 1.517917 -1.487316
H  -5.017186 -0.04368 -1.069344
H  0.124491 0.242905 -1.918725
H  -5.355155 -1.595891 0.603221
H  -0.249426 2.415981 -2.758903
H  -6.026804 -2.212186 2.893086
H  -4.429369 -1.525094 3.572481
H  0.526096 3.692553 -0.632236
H  1.201805 -1.195682 -0.75091
H  2.599678 4.519649 0.553816
H  5.179929 0.868185 1.55598
H  5.052482 -1.617117 1.237171
H  4.961205 -3.590637 -0.073938
H  3.660137 -4.820022 0.145947
H  4.146416 -3.773475 1.532177
