program: Orca
programVersion: 5.0.3
elementType: C H C H C C C H H C H H C C H H H H H H H
charge: 1
multiplicity: 1
keywords: b3lyp def2-TZVP EnGrad D3BJ RIJCOSX verytightscf def2/J soscf
formula: C8H13
InChI: InChI=1/C8H13/c1-3-7-5-2-6-8(4-1)9-7/h3,6-8H,1-2,4-5H2
21 atoms
C  -1.996904 0.672268 0.102554
H  -2.192785 0.863771 1.161999
C  -1.823505 -0.93062 -0.131868
H  -2.64137 -1.433736 0.386931
C  -0.453201 -1.335178 0.396384
C  0.689262 -1.272095 -0.366646
C  2.000022 -0.670989 0.0916
H  2.200267 -0.872694 1.148349
H  2.850593 -1.011541 -0.501594
C  1.826562 0.929808 -0.130732
H  1.909393 1.15166 -1.199472
H  2.641096 1.434601 0.391806
C  0.452183 1.320755 0.402351
C  -0.694014 1.285379 -0.357433
H  0.540392 -1.240623 -1.449896
H  -1.908449 -1.142648 -1.202382
H  0.003058 -0.000902 0.138685
H  -0.55427 1.283148 -1.442118
H  -2.853316 1.010742 -0.483321
H  0.345533 1.342883 1.489906
H  -0.345389 -1.382335 1.482963
totalener: -312.18704119 hartree
nucrepener: 382.84391369 hartree
electener: -695.03095488 hartree
oneelecener: -1166.23594862 hartree
twoeener: 471.20499374 hartree
kineticenergy: 310.50114431 hartree
exchangeener: -36.318433075192 hartree
correlationener: -2.309164408099 hartree
xcener: -38.627597483291 hartree
chargesum: 1.0000000
charge: -0.214015 0.156553 -0.235555 0.172218 -0.086421 -0.036884 -0.215376 0.156143 0.170246 -0.237220 0.158551 0.172021 -0.083411 -0.041179 0.153386 0.158971 0.195265 0.153866 0.170274 0.166448 0.166121
charge: -0.195389 0.153263 -0.193612 0.156949 -0.129119 -0.088345 -0.195694 0.153062 0.156989 -0.193936 0.152801 0.156708 -0.132160 -0.085985 0.164323 0.152988 0.317993 0.163905 0.157089 0.164304 0.163867
qa: -0.2140 0.1566 -0.2356 0.1722 -0.0864 -0.0369 -0.2154 0.1561 0.1702 -0.2372 0.1586 0.1720 -0.0834 -0.0412 0.1534 0.1590 0.1953 0.1539 0.1703 0.1664 0.1661
va: 3.8649 0.9686 3.8947 0.9674 3.7702 3.8096 3.8680 0.9686 0.9672 3.8980 0.9676 0.9675 3.7590 3.8229 0.9641 0.9676 0.9741 0.9637 0.9670 0.9628 0.9627
dispcorr: -0.037004391 hartree
energy: -312.224045576870
dipole: -0.00488 -0.00293 -0.00781 0.00282 -0.00459 -0.00177 -0.07285 0.05746 -0.01538
magnitude: 0.01734 au
magnitude: 0.04408 debye
