program: Orca
programVersion: 5.0.3
elementType: C H C H C C C H H C H H C C H H H H H H H
charge: 1
multiplicity: 1
keywords: DSD-PBEP86/2013 def2-TZVP D3BJ RIJCOSX verytightscf def2-TZVP/C def2/J soscf noTRAH
formula: C8H13
InChI: InChI=1/C8H13/c1-2-4-6-8-7-5-3-1/h1-2,7H,3-6,8H2
21 atoms
C  -1.999366 0.759537 0.069766
H  -2.161951 0.828418 1.148025
C  -1.72973 -0.968504 -0.159322
H  -2.618448 -1.319428 0.369382
C  -0.415584 -1.387202 0.392263
C  0.685547 -1.275468 -0.378849
C  2.000817 -0.692747 0.062737
H  2.20832 -0.891782 1.119691
H  2.855559 -1.034645 -0.526958
C  1.788637 0.855035 -0.139386
H  1.828645 1.116513 -1.202496
H  2.592399 1.404273 0.357939
C  0.422172 1.264708 0.490723
C  -0.767738 1.299402 -0.371573
H  0.520807 -1.199802 -1.458405
H  -1.833248 -1.128188 -1.233001
H  0.193851 0.60682 1.3345
H  -0.659345 1.599145 -1.417608
H  -2.882934 0.993179 -0.522485
H  0.474789 2.267894 0.964205
H  -0.333752 -1.485087 1.4742
totalener: -311.12390735 hartree
nucrepener: 379.43143681 hartree
electener: -690.55534416 hartree
oneelecener: -1159.30685399 hartree
twoeener: 468.75150983 hartree
kineticenergy: 310.01802811 hartree
exchangeener: -14.120689210362 hartree
correlationener: -0.943002920008 hartree
xcener: -15.063692130369 hartree
chargesum: 1.0000000
charge: -0.275165 0.200427 -0.195646 0.193559 -0.210864 -0.104301 -0.214525 0.154523 0.165304 -0.270978 0.152563 0.168985 -0.147781 0.106322 0.139888 0.187251 0.149610 0.214801 0.195921 0.216275 0.173832
charge: -0.166360 0.168818 -0.111103 0.158066 -0.188629 -0.119365 -0.214661 0.148415 0.147820 -0.201926 0.141790 0.150307 -0.209391 0.146583 0.151148 0.152680 0.171933 0.173630 0.157623 0.194083 0.148539
qa: -0.2752 0.2004 -0.1956 0.1936 -0.2109 -0.1043 -0.2145 0.1545 0.1653 -0.2710 0.1526 0.1690 -0.1478 0.1063 0.1399 0.1873 0.1496 0.2148 0.1959 0.2163 0.1738
va: 3.8766 0.9578 3.8298 0.9570 3.8442 3.8501 3.8715 0.9722 0.9737 3.9064 0.9692 0.9681 3.7697 3.5472 0.9685 0.9587 0.9987 0.9453 0.9651 0.9439 0.9632
total: -311.778559011 hartree
dispcorr: -0.014216776 hartree
energy: -311.792775787126
dipole: 0.17293 -1.08035 -0.90742 1.64566 -0.41828 1.22739 0.38114 -0.55795 -0.17682
magnitude: 1.53660 au
magnitude: 3.90573 debye
