program: Orca
programVersion: 5.0.3
elementType: C H C H C C C H H C H H C C H H H H H H H
charge: 1
multiplicity: 1
keywords: m062x cc-pVTZ EnGrad RIJCOSX verytightscf cc-pVTZ/C def2/J soscf
formula: C8H13
InChI: InChI=1/C8H13/c1-2-4-6-8-7-5-3-1/h1-2,7H,3-6,8H2
21 atoms
C  -2.00118 0.75511 0.069179
H  -2.163172 0.81911 1.147818
C  -1.730073 -0.973257 -0.162881
H  -2.618976 -1.328141 0.36287
C  -0.412901 -1.387169 0.389835
C  0.683431 -1.272793 -0.38345
C  1.998516 -0.696317 0.062614
H  2.203862 -0.900836 1.118857
H  2.854354 -1.036047 -0.527094
C  1.787734 0.846095 -0.13587
H  1.823372 1.10961 -1.198734
H  2.591938 1.396736 0.359276
C  0.423757 1.27787 0.494742
C  -0.766865 1.294418 -0.364447
H  0.518349 -1.193878 -1.462709
H  -1.830568 -1.132495 -1.237054
H  0.208968 0.687276 1.389177
H  -0.659236 1.623987 -1.401574
H  -2.882936 0.997013 -0.522556
H  0.495739 2.323581 0.866332
H  -0.328891 -1.478056 1.472022
totalener: -312.27051380 hartree
nucrepener: 379.26048563 hartree
electener: -691.53099942 hartree
oneelecener: -1159.29092621 hartree
twoeener: 467.75992679 hartree
kineticenergy: 310.03290167 hartree
xcener: -23.082834115788 hartree
chargesum: 1.0000000
charge: -0.329837 0.226943 -0.282048 0.207603 -0.157343 -0.124386 -0.297073 0.179907 0.183535 -0.290767 0.182549 0.187099 -0.271479 0.108108 0.186265 0.209525 0.174571 0.259795 0.206382 0.234808 0.205844
charge: 0.129735 0.014220 0.175492 0.006382 0.018864 0.063838 0.072195 -0.002866 -0.001542 0.104181 -0.010299 0.000012 0.076162 0.308908 -0.015610 -0.000471 0.007291 0.021146 0.005741 0.047476 -0.020855
qa: -0.3298 0.2269 -0.2820 0.2076 -0.1573 -0.1244 -0.2971 0.1799 0.1835 -0.2908 0.1825 0.1871 -0.2715 0.1081 0.1863 0.2095 0.1746 0.2598 0.2064 0.2348 0.2058
va: 3.7453 0.9405 3.7683 0.9484 3.6170 3.6555 3.7771 0.9614 0.9600 3.7294 0.9565 0.9553 3.7415 3.3546 0.9573 0.9472 0.9755 0.9262 0.9586 0.9392 0.9531
energy: -312.270513795726
dipole: 0.19927 -1.06846 -0.86918 1.76794 -0.59302 1.17492 0.34331 -0.48264 -0.13934
magnitude: 1.46810 au
magnitude: 3.73162 debye
