program: Orca
programVersion: 5.0.3
elementType: C H C H C C C H H C H H C C H H H H H H H
charge: 1
multiplicity: 1
keywords: DSD-PBEP86/2013 def2-TZVP D3BJ RIJCOSX verytightscf def2-TZVP/C def2/J soscf noTRAH
formula: C8H13
InChI: InChI=1/C8H13/c1-2-4-6-8-7-5-3-1/h1-2,7H,3-6,8H2
21 atoms
C  -1.990158 0.561911 0.10408
H  -2.166255 0.744532 1.168996
C  -1.871696 -0.972793 -0.174767
H  -2.662988 -1.528395 0.335146
C  -0.466775 -1.259927 0.326631
C  0.635016 -1.205495 -0.464569
C  1.926138 -0.682851 0.072405
H  2.066877 -0.94691 1.125825
H  2.794631 -1.038061 -0.491389
C  1.843477 0.871502 -0.079618
H  1.905184 1.138169 -1.141403
H  2.690495 1.350657 0.419554
C  0.514009 1.45584 0.510311
C  -0.636803 1.064214 -0.307721
H  0.530473 -1.298654 -1.546192
H  -1.945343 -1.169653 -1.249171
H  0.376769 1.209238 1.566677
H  -0.51545 1.241889 -1.380657
H  -2.789643 1.026227 -0.484554
H  0.610295 2.556018 0.428523
H  -0.331896 -1.250905 1.409768
totalener: -311.15477738 hartree
nucrepener: 381.60477607 hartree
electener: -692.75955345 hartree
oneelecener: -1163.60141591 hartree
twoeener: 470.84186246 hartree
kineticenergy: 310.01858416 hartree
exchangeener: -14.124694286174 hartree
correlationener: -0.944605731870 hartree
xcener: -15.069300018044 hartree
chargesum: 1.0000000
charge: -0.205338 0.170519 -0.205760 0.176657 -0.132540 -0.131918 -0.220628 0.156264 0.168779 -0.238537 0.150118 0.173906 -0.183080 0.070773 0.174792 0.163005 0.160671 0.205525 0.181017 0.198616 0.167158
charge: -0.197074 0.158302 -0.194713 0.150448 -0.090765 -0.109517 -0.217837 0.151320 0.154753 -0.199989 0.145283 0.150501 -0.217617 0.169817 0.156737 0.152745 0.156619 0.173764 0.159774 0.189809 0.157641
qa: -0.2053 0.1705 -0.2058 0.1767 -0.1325 -0.1319 -0.2206 0.1563 0.1688 -0.2385 0.1501 0.1739 -0.1831 0.0708 0.1748 0.1630 0.1607 0.2055 0.1810 0.1986 0.1672
va: 3.8452 0.9693 3.8528 0.9698 3.8655 3.8586 3.8992 0.9715 0.9706 3.8679 0.9715 0.9636 3.8836 3.5632 0.9609 0.9739 0.9739 0.9423 0.9687 0.9585 0.9638
total: -311.807435644 hartree
dispcorr: -0.014291646 hartree
energy: -311.821727289811
dipole: 0.52770 -0.98635 -0.45864 1.90422 -1.01200 0.89222 0.15079 -0.32121 -0.17041
magnitude: 1.01757 au
magnitude: 2.58646 debye
