program: Gaussian 09
title: 000050891
version: EM64L-G09RevD.01
frameworkgroup: C1[X(C12H4Cl6)]
method: RPBEPBE
basis: SDD
operation: Freq
keyword: #pfreq=noraman
keyword: PBEPBE/SDD
title: #p freq=noraman PBEPBE/SDD
converged: NO NO NO NO
title: Mulliken charges:
elementType: Cl Cl Cl Cl Cl Cl C C C C C C C C C C C C H H H H
charge: 0.025444 0.003505 0.003512 0.043057 0.049092 0.014200 0.329540 0.405569 -0.364902 -0.364775 -0.294300 -0.369760 -0.041009 -0.041070 -0.049208 -0.217534 -0.102895 -0.119433 0.279549 0.279554 0.263818 0.268048
chargesum: 0.00000
title: Mulliken charges with hydrogens summed into heavy atoms:
elementType: Cl Cl Cl Cl Cl Cl C C C C C C C C C C C C
charge: 0.025444 0.003505 0.003512 0.043057 0.049092 0.014200 0.329540 0.405569 -0.085354 -0.085221 -0.294300 -0.105943 -0.041009 -0.041070 -0.049208 0.050514 -0.102895 -0.119433
polarizability: 2.82346356e+02 -9.95170751e-02 1.47140121e+02 1.08055377e+01 -1.25800461e-01 1.41817941e+02
1716.lowfreq: -19.1625 -1.9734 -0.0017 0.0016 0.0028 3.7947 7.4542 34.5484 38.7047
frequency: -19.1040 34.5256 38.7042 75.9148 77.7781 128.1112 150.8402 182.2793 187.8241 194.4417 198.5143 205.2746 220.2366 235.8691 310.6911 315.4202 328.8267 332.8260 427.8305 432.3689 468.5424 478.9597 481.3962 511.2006 512.4353 564.9255 603.3364 627.0498 699.4850 722.4771 731.5220 740.4591 766.7494 823.3114 850.7670 883.3214 891.7886 951.2220 1003.0846 1025.6776 1089.8064 1145.4526 1154.2064 1163.5507 1193.6109 1286.5069 1336.2010 1339.8619 1350.9625 1369.1048 1409.3306 1450.6282 1542.6132 1543.5637 1577.2583 1594.5849 3156.5151 3169.9844 3172.3705 3179.0686
redmass: 13.8046 17.2806 16.3411 30.2652 27.5558 8.2173 22.0339 13.9798 4.8518 25.4926 31.5175 31.3162 19.3039 7.5092 8.0124 8.0020 28.1482 29.6411 7.5648 6.7002 10.2905 10.7635 6.9994 5.1865 5.1509 9.4009 5.3427 6.9489 3.9667 6.9217 7.5967 9.5266 7.0377 1.4344 7.9116 1.6086 1.3520 1.3501 7.9724 6.9050 3.8706 2.0011 1.5114 2.3406 1.6316 2.6821 5.2921 5.2315 6.2958 4.0798 2.7186 4.6510 8.8641 8.1541 7.3758 7.3884 1.0894 1.0928 1.0939 1.0972
irintensity: 0.3058 0.2716 0.2604 0.0276 0.0790 0.1871 0.0628 0.1523 0.0027 0.0721 0.0793 0.0377 0.0041 2.4681 0.0695 2.3069 0.2098 0.2451 4.0231 14.2258 6.8110 23.9060 2.0728 0.1856 0.7418 1.2070 3.2942 5.0845 4.5078 19.4681 10.9183 55.1351 89.0838 18.2514 29.9734 15.2505 0.2638 0.0488 19.2370 1.3890 20.8463 41.5363 8.4044 26.1146 13.5110 12.0098 29.7125 19.0215 25.5318 29.3774 172.8729 15.3393 75.0543 2.6389 5.2464 21.5190 2.1697 0.2429 0.0621 0.7648
temp: 298.150 k
press: 1.00000 atm
elementType: 17 17 17 17 17 17 6 6 6 6 6 6 6 6 6 6 6 6 1 1 1 1
symmnumber: 1
zpe: 314864.1 jmol-1
zpe.correction: 0.119925 hartree
zpe.thermalcorrener: 0.136085 hartree
zpe.thermalcorrenthalpy: 0.137030 hartree
zpe.thermalcorrgfe: 0.074005 hartree
zpe.sumelectzpe: -3218.770730 hartree
zpe.sumelectthermal: -3218.754570 hartree
zpe.sumelectthermalent: -3218.753626 hartree
zpe.sumelectthermalfe: -3218.816651 hartree
dipole: -1.1103 0.0250 -2.5248
dipole: 2.7582
quadrupole: -160.0315 -144.3433 -139.2732
quadrupole: -0.0435 4.4173 -0.0553
quadrupole: -12.1488 3.5394 8.6094 -0.0435 4.4173 -0.0553
hfenergy: -3218.8906558 hartree
pointgroup: C01 [X(C12H4Cl6)]
dipole: -0.464968 0.007272 -0.980479 debye
dipolederiv: -0.2107938 0.0015611 -0.2173058 0.001885 -0.012769 0.003852 -0.2463923 0.0038729 -0.5369249 -0.2505296 0.2563889 -0.0051223 0.3378247 -0.5979859 0.0075357 -0.0125091 0.0115935 -0.0249303 -0.2505789 -0.2563759 -0.0078674 -0.3376797 -0.597705 -0.0136962 -0.0161045 -0.0176818 -0.0251955 -0.3179518 -0.0022599 0.2913977 -0.0029726 0.0044287 0.0031239 0.3802581 0.0031038 -0.3960956 -0.7359929 0.0001984 -0.0351851 0.0002811 -0.0044977 -0.0000684 -0.0497229 -0.0000488 0.0061903 -0.8146951 0.0011385 -0.1476543 0.0010135 -0.0202787 0.0004991 -0.135412 0.000479 -0.0838125 0.3796836 0.0002913 -0.0337907 -0.000155 0.1915325 0.0014539 -0.0108061 0.0012737 -0.0484361 0.3332859 0.0003252 -0.0434754 0.0007568 -0.0776531 0.0007288 -0.0945363 0.0008562 -0.1707364 -0.3228276 -0.1648102 0.0021555 -0.0209625 -0.2000464 0.0003739 -0.0250972 0.0075377 -0.0707637 -0.3230008 0.1647548 0.0039915 0.0213804 -0.1998971 -0.001688 -0.0246676 -0.0088742 -0.0707273 0.1125154 -0.0029537 0.4027382 -0.0030919 -0.0235343 -0.0052031 0.4230526 -0.0051881 0.6967886 -0.0922317 -0.0001838 0.0213115 -0.0008339 -0.1188549 -0.0013721 0.0765427 -0.0013634 0.0691979 0.1839646 -0.4375338 0.0054413 -0.4375964 0.9120027 -0.0089397 0.0197765 -0.021522 -0.0147933 0.1838152 0.4374852 0.0101519 0.4375674 0.911529 0.0187858 0.0247806 0.0313268 -0.0143425 0.1017989 0.004625 -0.599212 0.0051931 -0.0196534 -0.0036436 -0.6808723 -0.003606 0.4335788 -0.3175123 0.0003544 -0.0474154 0.0000664 -0.0874978 -0.0005852 0.0227451 -0.0006417 -0.0082522 0.9599954 -0.0003648 0.0610295 -0.0005508 -0.3836747 -0.0017528 0.068318 -0.0017667 -0.0492101 1.129436 -0.002601 0.3317432 -0.0019274 -0.0466012 -0.0004753 0.250317 -0.000474 0.0176886 0.084208 0.0499023 -0.0101604 0.0692168 0.0345772 -0.0007223 -0.0082863 -0.0026612 0.1391431 0.0841757 -0.0497088 -0.010657 -0.0690746 0.0345272 -0.0004382 -0.0090497 0.0016142 0.1391704 0.0427324 -0.0005421 0.069703 -0.00068 0.1380944 0.0010111 0.0891209 0.0009456 0.0093867 0.0405033 0.0003091 -0.0418177 0.0003395 0.1639574 0.0012207 -0.0414552 0.0012244 0.0030762 unknown
polarizability: 282.8482852|-0.0356775|147.1394451|6.7810567|-0.1344874|141.3166884 unknown
InChI: InChI=1S/C12H4Cl6/c13-7-2-1-6(10(16)12(7)18)5-3-8(14)11(17)9(15)4-5/h1-4H
charge 0 multiplicity 1
22 atoms
Cl -1.008434 -0.018559 2.438065
Cl 3.588994 -2.801476 -0.021244
Cl 3.589286 2.80176 0.008483
Cl -4.219524 -0.016495 2.089169
Cl 5.246895 -0.000554 0.10972
Cl -5.497507 0.006624 -0.899725
C  0.610808 0.001386 -0.21177
C  -0.883386 0.002267 -0.34632
C  1.321936 1.223226 -0.156652
C  1.321813 -1.221055 -0.169692
C  -1.740191 -0.006312 0.783721
C  -1.475733 0.012117 -1.633768
C  2.726466 -1.213702 -0.071498
C  2.726598 1.214719 -0.058593
C  -3.150073 -0.005239 0.640271
C  -2.874833 0.013408 -1.796566
C  3.45141 0.0002 -0.014455
C  -3.706802 0.004737 -0.660034
H  0.79007 2.178194 -0.183467
H  0.789912 -2.17566 -0.206787
H  -0.826543 0.018792 -2.514588
H  -3.32346 0.021021 -2.79347
