program: Orca
programVersion: 5.0.3
elementType: C H C H C C C H H C H H C C H H H H H H H
charge: 1
multiplicity: 1
keywords: DSD-PBEP86/2013 def2-TZVP RIJCOSX verytightscf def2-TZVP/C def2/J soscf noTRAH
formula: C8H13
InChI: InChI=1/C8H12.H/c1-2-4-6-8-7-5-3-1;/h1-2,7-8H,3-6H2;
21 atoms
C  -1.975895 0.654195 0.123672
H  -2.128938 0.845525 1.190479
C  -1.84993 -0.948827 -0.119685
H  -2.653018 -1.441019 0.431969
C  -0.469466 -1.348259 0.373103
C  0.673167 -1.25893 -0.384773
C  1.975845 -0.654956 0.111444
H  2.132229 -0.855651 1.176088
H  2.844913 -1.012569 -0.443786
C  1.85024 0.949246 -0.116833
H  1.971476 1.172964 -1.181468
H  2.654309 1.437215 0.437225
C  0.470771 1.343457 0.383942
C  -0.674991 1.261303 -0.371854
H  0.550055 -1.266483 -1.471257
H  -1.974319 -1.162023 -1.186031
H  0.000526 0.003063 0.002563
H  -0.554812 1.27493 -1.458288
H  -2.84659 1.015819 -0.426194
H  0.351345 1.334244 1.467929
H  -0.345914 -1.341309 1.460072
totalener: -311.10544993 hartree
nucrepener: 382.90672897 hartree
electener: -694.01217890 hartree
oneelecener: -1165.69845893 hartree
twoeener: 471.68628003 hartree
kineticenergy: 309.93659647 hartree
exchangeener: -12.752427904048 hartree
correlationener: -0.949834436351 hartree
xcener: -13.702262340399 hartree
chargesum: 1.0000000
charge: -0.235142 0.167506 -0.235127 0.182203 -0.092891 -0.090543 -0.234501 0.167381 0.181904 -0.234328 0.167639 0.182228 -0.093528 -0.087044 0.172072 0.167531 0.215328 0.172486 0.182051 0.172555 0.172218
charge: -0.193516 0.150784 -0.193661 0.154039 -0.107133 -0.105248 -0.193898 0.150803 0.153979 -0.193583 0.150766 0.154107 -0.105414 -0.103356 0.163237 0.150681 0.323720 0.163450 0.154025 0.162800 0.163418
qa: -0.2351 0.1675 -0.2351 0.1822 -0.0929 -0.0905 -0.2345 0.1674 0.1819 -0.2343 0.1676 0.1822 -0.0935 -0.0870 0.1721 0.1675 0.2153 0.1725 0.1821 0.1726 0.1722
va: 3.8958 0.9699 3.8971 0.9673 3.8480 3.8483 3.8953 0.9699 0.9674 3.8958 0.9698 0.9673 3.8494 3.8450 0.9642 0.9698 0.9895 0.9642 0.9674 0.9644 0.9644
total: -311.801486545 hartree
energy: -311.801486545077
dipole: 0.00139 -0.00295 -0.00156 0.00760 0.00475 0.01235 0.00074 -0.00272 -0.00198
magnitude: 0.01260 au
magnitude: 0.03204 debye
