program: Orca
programVersion: 5.0.3
elementType: C H C H C C C H H C H H C C H H H H H H H
charge: 1
multiplicity: 1
keywords: DSD-PBEP86 def2-TZVP RIJCOSX verytightscf def2-TZVP/C def2/J soscf noTRAH
formula: C8H13
InChI: InChI=1/C8H13/c1-3-7-5-2-6-8(4-1)9-7/h3,6-8H,1-2,4-5H2
21 atoms
C  -1.996904 0.672268 0.102554
H  -2.192785 0.863771 1.161999
C  -1.823505 -0.93062 -0.131868
H  -2.64137 -1.433736 0.386931
C  -0.453201 -1.335178 0.396384
C  0.689262 -1.272095 -0.366646
C  2.000022 -0.670989 0.0916
H  2.200267 -0.872694 1.148349
H  2.850593 -1.011541 -0.501594
C  1.826562 0.929808 -0.130732
H  1.909393 1.15166 -1.199472
H  2.641096 1.434601 0.391806
C  0.452183 1.320755 0.402351
C  -0.694014 1.285379 -0.357433
H  0.540392 -1.240623 -1.449896
H  -1.908449 -1.142648 -1.202382
H  0.003058 -0.000902 0.138685
H  -0.55427 1.283148 -1.442118
H  -2.853316 1.010742 -0.483321
H  0.345533 1.342883 1.489906
H  -0.345389 -1.382335 1.482963
totalener: -311.10421086 hartree
nucrepener: 382.84391369 hartree
electener: -693.94812456 hartree
oneelecener: -1165.58784049 hartree
twoeener: 471.63971593 hartree
kineticenergy: 309.93564540 hartree
exchangeener: -12.752228231974 hartree
correlationener: -0.949737941126 hartree
xcener: -13.701966173099 hartree
chargesum: 1.0000000
charge: -0.224213 0.166880 -0.246714 0.183186 -0.119398 -0.057084 -0.226280 0.166530 0.180981 -0.249205 0.168368 0.182870 -0.113960 -0.063496 0.166296 0.168662 0.208236 0.167184 0.181074 0.180111 0.179974
charge: -0.194079 0.151104 -0.192682 0.153864 -0.128518 -0.081193 -0.194347 0.150911 0.154171 -0.192964 0.150360 0.153636 -0.131910 -0.078113 0.163960 0.150537 0.320960 0.163626 0.154266 0.163401 0.163009
qa: -0.2242 0.1669 -0.2467 0.1832 -0.1194 -0.0571 -0.2263 0.1665 0.1810 -0.2492 0.1684 0.1829 -0.1140 -0.0635 0.1663 0.1687 0.2082 0.1672 0.1811 0.1801 0.1800
va: 3.8799 0.9705 3.9127 0.9672 3.8209 3.8597 3.8835 0.9704 0.9674 3.9165 0.9688 0.9675 3.8070 3.8738 0.9649 0.9689 0.9956 0.9642 0.9672 0.9634 0.9631
total: -311.800479421 hartree
energy: -311.800479421413
dipole: -0.00488 -0.00406 -0.00893 0.00282 -0.00319 -0.00037 -0.07285 0.04246 -0.03038
magnitude: 0.03167 au
magnitude: 0.08050 debye
