program: Orca
programVersion: 5.0.3
elementType: C H C H C C C H H C H H C C H H H H H H H
charge: 1
multiplicity: 1
keywords: PBE0 def2-TZVP EnGrad RIJCOSX verytightscf def2/J soscf
formula: C8H13
InChI: InChI=1/C8H13/c1-2-4-6-8-7-5-3-1/h1-2,7H,3-6,8H2
21 atoms
C  -1.997597 0.758467 0.071335
H  -2.165969 0.839453 1.148032
C  -1.732194 -0.960571 -0.155077
H  -2.618367 -1.316292 0.375022
C  -0.419301 -1.384283 0.39518
C  0.688008 -1.27887 -0.374111
C  2.002897 -0.6898 0.063608
H  2.212545 -0.883932 1.121154
H  2.856642 -1.03254 -0.526655
C  1.791057 0.866481 -0.142686
H  1.837651 1.123238 -1.206525
H  2.595788 1.412246 0.356606
C  0.421678 1.255266 0.482487
C  -0.767054 1.305825 -0.377363
H  0.524083 -1.206872 -1.454007
H  -1.836727 -1.124015 -1.228095
H  0.173868 0.508873 1.246443
H  -0.656648 1.55299 -1.436767
H  -2.88058 0.987655 -0.523847
H  0.448727 2.177833 1.094674
H  -0.339066 -1.49357 1.476637
totalener: -312.03107250 hartree
nucrepener: 379.70033381 hartree
electener: -691.73140631 hartree
oneelecener: -1160.43802263 hartree
twoeener: 468.70661632 hartree
kineticenergy: 310.16247934 hartree
exchangeener: -34.164909103594 hartree
correlationener: -1.962159078915 hartree
xcener: -36.127068182508 hartree
chargesum: 1.0000000
charge: -0.247185 0.201012 -0.216790 0.197716 -0.206346 -0.079822 -0.226813 0.161403 0.166846 -0.272940 0.159410 0.171621 -0.155949 0.070128 0.138341 0.190078 0.154291 0.199696 0.196874 0.221898 0.176531
charge: -0.167133 0.173714 -0.125160 0.166830 -0.192690 -0.113036 -0.222706 0.154588 0.153767 -0.208734 0.148657 0.157319 -0.215756 0.093156 0.156468 0.158735 0.188623 0.172670 0.164186 0.202631 0.153869
qa: -0.2472 0.2010 -0.2168 0.1977 -0.2063 -0.0798 -0.2268 0.1614 0.1668 -0.2729 0.1594 0.1716 -0.1559 0.0701 0.1383 0.1901 0.1543 0.1997 0.1969 0.2219 0.1765
va: 3.9160 0.9572 3.8876 0.9550 3.9081 3.9142 3.9121 0.9692 0.9734 3.9696 0.9677 0.9673 3.8175 3.7154 0.9675 0.9586 1.0096 0.9530 0.9633 0.9448 0.9602
energy: -312.031072501719
dipole: 0.14222 -0.98831 -0.84609 1.44662 -0.39884 1.04777 0.41460 -0.51155 -0.09694
magnitude: 1.35022 au
magnitude: 3.43199 debye
