program: Orca
programVersion: 5.0.3
elementType: C H C H C C C H H C H H C C H H H H H H H
charge: 1
multiplicity: 1
keywords: b3lyp cc-pVTZ EnGrad RIJCOSX verytightscf cc-pVTZ/C def2/J soscf
formula: C8H13
InChI: InChI=1/C8H13/c1-2-4-6-8-7-5-3-1/h1-2,7H,3-6,8H2
21 atoms
C  -1.99269 0.51825 0.069649
H  -2.196727 0.788408 1.10905
C  -2.000089 -1.02298 -0.119069
H  -2.680108 -1.577666 0.528049
C  -0.542919 -1.085099 0.291292
C  0.571486 -1.058323 -0.529243
C  1.901142 -0.628134 0.015016
H  2.023895 -1.001549 1.037413
H  2.718463 -1.022373 -0.594112
C  1.936751 0.938966 0.023169
H  2.144529 1.301075 -0.989878
H  2.749179 1.288196 0.665581
C  0.568035 1.46863 0.491322
C  -0.491057 0.707634 -0.262846
H  0.466894 -1.272934 -1.591773
H  -2.158281 -1.315912 -1.160567
H  0.432478 1.370173 1.573775
H  -0.365556 0.802804 -1.344825
H  -2.648052 1.088987 -0.593289
H  0.469965 2.534897 0.245478
H  -0.363203 -1.028083 1.36546
totalener: -312.25285545 hartree
nucrepener: 387.54035739 hartree
electener: -699.79321284 hartree
oneelecener: -1175.86608152 hartree
twoeener: 476.07286868 hartree
kineticenergy: 310.01984521 hartree
exchangeener: -36.334838886464 hartree
correlationener: -2.310805619811 hartree
xcener: -38.645644506275 hartree
chargesum: 1.0000000
charge: -0.160504 0.142855 -0.183815 0.155755 -0.004560 -0.013618 -0.190954 0.137643 0.153497 -0.192551 0.135649 0.150333 -0.175971 -0.057702 0.188964 0.140448 0.129656 0.162535 0.153221 0.160057 0.169059
charge: 0.113728 -0.001492 0.113173 -0.002366 0.126697 0.180280 0.090774 0.001419 0.005015 0.100833 -0.007638 -0.001549 0.071653 0.184998 0.003577 -0.002144 -0.005330 0.003753 -0.003838 0.014550 0.013907
qa: -0.1605 0.1429 -0.1838 0.1558 -0.0046 -0.0136 -0.1910 0.1376 0.1535 -0.1926 0.1356 0.1503 -0.1760 -0.0577 0.1890 0.1404 0.1297 0.1625 0.1532 0.1601 0.1691
va: 3.8237 0.9913 3.8460 0.9838 3.7417 3.7289 3.8726 0.9884 0.9835 3.8464 0.9864 0.9816 3.8440 3.7157 0.9760 0.9917 0.9919 0.9975 0.9815 0.9765 0.9927
energy: -312.252855448317
dipole: 0.55616 -0.70229 -0.14613 1.83094 -1.92756 -0.09662 0.23448 -0.40082 -0.16635
magnitude: 0.24158 au
magnitude: 0.61405 debye
