program: Orca
programVersion: 5.0.3
elementType: C H C H C C C H H C H H C C H H H H H H H
charge: 1
multiplicity: 1
keywords: b3lyp cc-pVTZ EnGrad RIJCOSX verytightscf cc-pVTZ/C def2/J soscf
formula: C8H13
InChI: InChI=1/C8H13/c1-2-4-6-8-7-5-3-1/h1-2,7H,3-6,8H2
21 atoms
C  -1.998823 0.759882 0.070097
H  -2.162407 0.831319 1.148069
C  -1.730077 -0.966628 -0.158198
H  -2.618389 -1.317776 0.371101
C  -0.416526 -1.386741 0.393002
C  0.68618 -1.27636 -0.377526
C  2.001413 -0.69183 0.062897
H  2.209523 -0.889387 1.120035
H  2.855864 -1.034151 -0.526869
C  1.78916 0.858004 -0.140365
H  1.830832 1.118468 -1.203623
H  2.59301 1.406508 0.357579
C  0.421924 1.261533 0.488959
C  -0.767777 1.301036 -0.373424
H  0.521648 -1.20174 -1.457183
H  -1.834153 -1.126926 -1.231714
H  0.188852 0.58111 1.313954
H  -0.659063 1.588678 -1.422817
H  -2.882524 0.991684 -0.522719
H  0.468109 2.247142 0.997338
H  -0.335232 -1.487251 1.474839
totalener: -312.20670087 hartree
nucrepener: 379.49341122 hartree
electener: -691.70011209 hartree
oneelecener: -1160.03391820 hartree
twoeener: 468.33380611 hartree
kineticenergy: 309.98667605 hartree
exchangeener: -36.295808665873 hartree
correlationener: -2.303685314966 hartree
xcener: -38.599493980838 hartree
chargesum: 1.0000000
charge: -0.199877 0.169591 -0.188511 0.174870 -0.118033 -0.087216 -0.169574 0.126484 0.145561 -0.202332 0.131701 0.149778 -0.179166 0.107198 0.133865 0.163641 0.131561 0.200443 0.176001 0.188192 0.145823
charge: 0.135148 0.012122 0.176537 0.006625 0.023204 0.077460 0.079260 -0.005699 -0.004482 0.109294 -0.013243 -0.002196 0.081712 0.299643 -0.017813 -0.002353 0.006969 0.013778 0.004657 0.043065 -0.023687
qa: -0.1999 0.1696 -0.1885 0.1749 -0.1180 -0.0872 -0.1696 0.1265 0.1456 -0.2023 0.1317 0.1498 -0.1792 0.1072 0.1339 0.1636 0.1316 0.2004 0.1760 0.1882 0.1458
va: 3.8321 0.9812 3.8548 0.9722 3.7877 3.8016 3.8540 0.9935 0.9835 3.8431 0.9905 0.9813 3.8361 3.5451 0.9933 0.9810 1.0109 0.9727 0.9800 0.9724 0.9963
energy: -312.206700871645
dipole: 0.16485 -1.02123 -0.85639 1.59914 -0.52930 1.06983 0.39145 -0.50241 -0.11096
magnitude: 1.37487 au
magnitude: 3.49463 debye
