program: Gaussian 09
title: 000050892
version: EM64L-G09RevD.01
frameworkgroup: C1[X(C12H3Cl7)]
method: RPBEPBE
basis: SDD
operation: Freq
keyword: #pfreq=noraman
keyword: PBEPBE/SDD
title: #p freq=noraman PBEPBE/SDD
converged: NO NO NO NO
title: Mulliken charges:
elementType: Cl Cl Cl Cl Cl Cl Cl C C C C C C C C C C C C H H H
charge: 0.048461 0.048464 0.062967 0.062972 0.070843 -0.036994 -0.036994 0.579804 0.313479 -0.338980 -0.338966 -0.330362 -0.330358 -0.084133 -0.084100 -0.105678 -0.056717 -0.056716 -0.224555 0.275571 0.275573 0.286418
chargesum: 0.00000
title: Mulliken charges with hydrogens summed into heavy atoms:
elementType: Cl Cl Cl Cl Cl Cl Cl C C C C C C C C C C C C
charge: 0.048461 0.048464 0.062967 0.062972 0.070843 -0.036994 -0.036994 0.579804 0.313479 -0.338980 -0.338966 -0.054791 -0.054785 -0.084133 -0.084100 -0.105678 -0.056717 -0.056716 0.061863
polarizability: 2.71450280e+02 -2.95064468e-03 1.84450175e+02 -1.41898091e-03 3.82693027e-02 1.49169229e+02
1716.lowfreq: -3.1708 0.0007 0.0017 0.0030 5.2335 5.4945 8.2021 31.9621 41.0660
frequency: 6.6876 31.9219 41.0512 65.1099 76.0894 99.6619 133.4859 154.1832 186.1974 193.5612 196.4389 204.3046 205.0135 216.8496 241.7371 246.8207 307.7615 320.7042 324.4329 328.9522 356.0579 377.0819 408.6390 441.6592 509.1694 516.3420 570.2925 596.8776 615.2359 637.3366 643.2093 702.7640 732.7729 751.0464 785.8944 816.7440 871.5912 874.0111 885.4101 891.5605 980.0134 1034.3196 1094.7843 1106.9814 1138.8509 1247.4094 1254.1223 1308.4957 1327.2499 1358.1536 1362.4828 1400.4580 1439.8046 1513.5669 1548.5481 1561.6511 1596.3535 3171.4146 3173.7279 3182.8379
redmass: 22.8218 23.7220 20.0791 34.2193 27.7082 20.9652 29.9933 9.5070 13.9326 4.5966 19.6116 29.5095 33.7837 32.5063 4.8788 16.6389 28.2508 9.2392 12.4745 30.6428 32.6743 13.4991 8.8080 7.1078 6.9385 5.3539 12.6005 12.0775 9.6494 10.1678 5.1815 3.1360 11.9245 11.1218 11.5417 12.1937 1.5252 11.0114 1.4710 1.3646 6.4233 8.9687 1.4950 1.8300 8.1977 6.6607 1.1880 11.9345 11.9971 4.9013 9.3080 2.9442 4.5310 11.9744 11.8912 7.1611 7.5314 1.0931 1.0940 1.0942
irintensity: 0.0000 0.0127 0.0043 0.0000 0.0153 0.0291 0.0704 0.1481 0.3437 0.0000 0.6858 0.0156 0.0130 0.0013 0.0529 0.1413 0.0436 0.2990 0.0000 0.0009 0.2167 6.9373 7.2885 1.1692 4.8953 0.0000 52.9998 0.0000 30.4877 0.6470 10.9182 54.6751 3.3889 67.4306 19.6607 0.8916 31.0780 25.6239 0.8350 0.0000 0.6412 37.9869 9.3929 6.8960 14.1137 16.8838 0.0923 176.3584 9.2075 156.8725 0.8488 51.1145 1.2893 0.0325 1.0411 126.3059 79.6177 0.1694 0.0092 1.3093
temp: 298.150 k
press: 1.00000 atm
elementType: 17 17 17 17 17 17 17 6 6 6 6 6 6 6 6 6 6 6 6 1 1 1
symmnumber: 1
zpe: 289292.2 jmol-1
zpe.correction: 0.110186 hartree
zpe.thermalcorrener: 0.128625 hartree
zpe.thermalcorrenthalpy: 0.129569 hartree
zpe.thermalcorrgfe: 0.059282 hartree
zpe.sumelectzpe: -3678.152855 hartree
zpe.sumelectthermal: -3678.134416 hartree
zpe.sumelectthermalent: -3678.133472 hartree
zpe.sumelectthermalfe: -3678.203760 hartree
dipole: -0.2189 0.0000 0.0001
dipole: 0.2189
quadrupole: -159.4342 -159.7957 -157.6321
quadrupole: 0.0000 -0.0003 0.0035
quadrupole: -0.4802 -0.8417 1.3219 0.0000 -0.0003 0.0035
hfenergy: -3678.2630411 hartree
pointgroup: C01 [X(C12H3Cl7)]
dipole: -0.0861329 0.0000032 -0.000012 debye
dipolederiv: -0.2430176 -0.2660635 0.0005362 -0.2677366 -0.513153 0.0009913 0.0005213 0.001011 0.0014629 -0.2430469 0.2660599 -0.0004466 0.2677412 -0.5131319 0.0008925 -0.0003741 0.0008427 0.0014617 -0.218155 -0.2879501 0.0005084 -0.3363858 -0.4964479 0.0008991 0.0005628 0.000847 0.0178004 -0.2182228 0.2879823 -0.0004562 0.336406 -0.4963584 0.0008295 -0.0005578 0.0008667 0.017801 -0.7270342 -0.0000113 0.0000523 0.0000082 -0.0019924 0.000041 -0.000013 0.0000208 0.0191421 -0.3611884 0.000814 0.2975566 0.0010233 -0.0532191 -0.0016388 0.3715781 -0.0016117 -0.6380887 -0.3613872 -0.0008813 -0.2976391 -0.0011197 -0.0532201 -0.0017068 -0.3716602 -0.0016913 -0.6378916 0.2742783 0.0000477 -0.00004 0.0000619 -0.3048032 0.0003931 0.0000232 0.0004186 -0.0389796 0.3231158 0.000009 -0.0000037 -0.0000442 -0.0157323 0.0007743 -0.0000537 0.0006459 0.2495124 0.2200793 0.4465289 -0.0008869 0.4807216 0.6419562 -0.0014022 -0.0009575 -0.0013585 -0.0357925 0.2201347 -0.4465765 0.0007638 -0.4807536 0.6418898 -0.0012074 0.0007724 -0.0011181 -0.0357996 -0.4063088 -0.0005598 -0.1936758 -0.0001725 -0.065305 -0.0004829 -0.0732594 -0.000491 -0.2364993 -0.406224 0.0005004 0.1937175 0.0001701 -0.0653067 -0.0004504 0.0733304 -0.0004758 -0.2365855 -0.0150213 0.5309507 -0.0009168 0.5973825 0.6117357 -0.0010821 -0.0010694 -0.0010676 -0.0267707 -0.0149303 -0.5309741 0.0008878 -0.5974579 0.6116055 -0.0009502 0.0010669 -0.0010272 -0.0267781 1.0013841 0.0000061 -0.0000258 0.0000337 -0.215384 0.0003049 0.0000352 0.000339 -0.020753 0.5828406 -0.0011851 -0.4508752 -0.0013947 -0.0367109 0.0029279 -0.5364721 0.002899 0.9948383 0.583125 0.0013473 0.4509973 0.0015661 -0.0367117 0.0030218 0.5365893 0.0030181 0.9945446 -0.1998534 -0.0000077 -0.0000506 -0.0000247 -0.0820016 -0.0013318 -0.0000554 -0.0013226 -0.5382125 0.092913 0.0001457 0.0529077 0.0002022 0.1366543 -0.0003257 0.0757262 -0.0002821 0.0331338 0.0928748 -0.0001628 -0.0529236 -0.0002166 0.1366535 -0.0003182 -0.0757459 -0.0002902 0.0331717 0.0236442 -0.0000198 0.0000128 -0.0000106 0.1689831 -0.0001789 0.0000126 -0.0001728 0.109282 unknown
polarizability: 271.4502775|0.0101357|184.4501956|-0.0146763|0.0275383|149.1692106 unknown
InChI: InChI=1S/C12H3Cl7/c13-5-1-4(2-6(14)3-5)7-8(15)10(17)12(19)11(18)9(7)16/h1-3H
charge 0 multiplicity 1
22 atoms
Cl -0.233295 2.774423 -0.004888
Cl -0.233153 -2.774595 0.004921
Cl -3.450301 -2.783251 0.005112
Cl -3.450593 2.782801 -0.004152
Cl -5.058212 -0.000152 0.000545
Cl 4.117962 -0.007614 -2.775357
Cl 4.118784 0.0084 2.774213
C  -0.404165 -0.000082 0.000088
C  1.097482 -0.000052 -0.000115
C  -1.138323 1.21261 -0.001839
C  -1.138241 -1.212817 0.002354
C  1.800743 0.003565 1.229113
C  1.800373 -0.00345 -1.229559
C  -2.55249 -1.225272 0.002518
C  -2.552574 1.224954 -0.001585
C  -3.261043 -0.00017 0.000541
C  3.207536 -0.003194 -1.203262
C  3.207893 0.003741 1.202389
C  3.940633 0.00039 -0.000546
H  1.263148 0.006247 2.181135
H  1.262495 -0.006224 -2.181419
H  5.033341 0.000543 -0.000709
