program: Orca
programVersion: 5.0.3
elementType: C H C H C C C H H C H H C C H H H H H H H
charge: 1
multiplicity: 1
keywords: PBE0 def2-TZVP EnGrad RIJCOSX verytightscf def2/J soscf
formula: C8H13
InChI: InChI=1/C8H13/c1-2-4-6-8-7-5-3-1/h1-2,7H,3-6,8H2
21 atoms
C  -1.993003 0.545699 0.115152
H  -2.168523 0.732446 1.178585
C  -1.909109 -0.983232 -0.174414
H  -2.670269 -1.558202 0.357624
C  -0.489338 -1.211074 0.304973
C  0.6238 -1.171245 -0.484271
C  1.915378 -0.669621 0.070581
H  2.03591 -0.949963 1.122388
H  2.780686 -1.040673 -0.486593
C  1.863805 0.889914 -0.059588
H  1.949831 1.166496 -1.117255
H  2.715393 1.340605 0.457539
C  0.535694 1.47469 0.503349
C  -0.596552 0.960252 -0.290319
H  0.533351 -1.30881 -1.561703
H  -2.00011 -1.181728 -1.246916
H  0.406888 1.290395 1.574126
H  -0.461574 1.053248 -1.371374
H  -2.760456 1.059646 -0.474684
H  0.578394 2.569593 0.35817
H  -0.346186 -1.174433 1.386565
totalener: -312.07497304 hartree
nucrepener: 383.17464239 hartree
electener: -695.24961543 hartree
oneelecener: -1167.31280285 hartree
twoeener: 472.06318742 hartree
kineticenergy: 310.16354668 hartree
exchangeener: -34.179308797095 hartree
correlationener: -1.968936200262 hartree
xcener: -36.148244997357 hartree
chargesum: 1.0000000
charge: -0.194671 0.165072 -0.203010 0.176328 -0.084607 -0.090111 -0.221424 0.160586 0.174797 -0.245102 0.157748 0.176636 -0.170610 -0.038932 0.183067 0.162027 0.156622 0.193374 0.178584 0.195161 0.168467
charge: -0.207498 0.160328 -0.201409 0.155580 -0.065709 -0.076795 -0.219494 0.159156 0.163815 -0.210813 0.153331 0.157168 -0.229034 0.080016 0.164598 0.158566 0.160236 0.173727 0.162929 0.193252 0.168051
qa: -0.1947 0.1651 -0.2030 0.1763 -0.0846 -0.0901 -0.2214 0.1606 0.1748 -0.2451 0.1577 0.1766 -0.1706 -0.0389 0.1831 0.1620 0.1566 0.1934 0.1786 0.1952 0.1685
va: 3.9141 0.9727 3.9032 0.9701 3.9271 3.9102 3.9540 0.9689 0.9690 3.9402 0.9692 0.9631 3.9468 3.8167 0.9567 0.9738 0.9730 0.9487 0.9686 0.9602 0.9629
energy: -312.074973042269
dipole: 0.55602 -0.80815 -0.25213 1.87088 -1.41614 0.45475 0.16520 -0.29472 -0.12952
magnitude: 0.53585 au
magnitude: 1.36203 debye
