program: Orca
programVersion: 5.0.3
elementType: C H C H C C C H H C H H C C H H H H H H H
charge: 1
multiplicity: 1
keywords: b3lyp def2-TZVP EnGrad D3BJ RIJCOSX verytightscf def2/J soscf
formula: C8H13
InChI: InChI=1/C8H13/c1-2-4-6-8-7-5-3-1/h1-2,7H,3-6,8H2
21 atoms
C  -1.994847 0.538912 0.118492
H  -2.170767 0.727541 1.181287
C  -1.927856 -0.988595 -0.173392
H  -2.672866 -1.571904 0.371364
C  -0.500787 -1.18354 0.294978
C  0.618491 -1.152679 -0.492777
C  1.911549 -0.662715 0.068908
H  2.023149 -0.95109 1.119536
H  2.773661 -1.042259 -0.486919
C  1.875506 0.899231 -0.049909
H  1.976302 1.181689 -1.104663
H  2.726816 1.33548 0.479628
C  0.545077 1.479598 0.498377
C  -0.576987 0.90604 -0.280009
H  0.533511 -1.308019 -1.568042
H  -2.028382 -1.189903 -1.24433
H  0.421084 1.322428 1.574341
H  -0.442187 0.976418 -1.362398
H  -2.743937 1.076158 -0.473474
H  0.557806 2.569716 0.323906
H  -0.354541 -1.138018 1.375722
totalener: -312.24912763 hartree
nucrepener: 384.06534741 hartree
electener: -696.31447504 hartree
oneelecener: -1169.08238023 hartree
twoeener: 472.76790519 hartree
kineticenergy: 310.54288061 hartree
exchangeener: -36.337447462507 hartree
correlationener: -2.307291031567 hartree
xcener: -38.644738494074 hartree
chargesum: 1.0000000
charge: -0.185261 0.153893 -0.187879 0.166428 -0.058837 -0.059517 -0.207992 0.149436 0.163209 -0.218332 0.144560 0.163031 -0.158939 -0.023065 0.180836 0.149639 0.144039 0.178534 0.166866 0.178875 0.160478
charge: -0.198623 0.155742 -0.192252 0.152229 -0.058050 -0.056986 -0.209942 0.155816 0.160386 -0.205193 0.149403 0.153677 -0.222257 0.062190 0.162671 0.154542 0.155414 0.170489 0.157736 0.185859 0.167149
qa: -0.1853 0.1539 -0.1879 0.1664 -0.0588 -0.0595 -0.2080 0.1494 0.1632 -0.2183 0.1446 0.1630 -0.1589 -0.0231 0.1808 0.1496 0.1440 0.1785 0.1669 0.1789 0.1605
va: 3.8561 0.9724 3.8432 0.9712 3.8080 3.7905 3.8861 0.9681 0.9696 3.8504 0.9686 0.9655 3.8766 3.6778 0.9565 0.9732 0.9734 0.9548 0.9694 0.9622 0.9654
dispcorr: -0.036373684 hartree
energy: -312.285501315220
dipole: 0.56195 -0.77728 -0.21534 1.86114 -1.54721 0.31393 0.17409 -0.31008 -0.13599
magnitude: 0.40425 au
magnitude: 1.02751 debye
