program: Orca
programVersion: 5.0.3
elementType: C H C H C C C H H C H H C C H H H H H H H
charge: 1
multiplicity: 1
keywords: m062x cc-pVTZ EnGrad RIJCOSX verytightscf cc-pVTZ/C def2/J soscf
formula: C8H13
InChI: InChI=1/C8H13/c1-2-4-6-8-7-5-3-1/h1-2,7H,3-6,8H2
21 atoms
C  -1.991619 0.590989 0.088068
H  -2.169156 0.765253 1.155524
C  -1.828338 -0.958676 -0.172799
H  -2.65079 -1.488194 0.316629
C  -0.441167 -1.30616 0.351028
C  0.650468 -1.237989 -0.439544
C  1.945431 -0.697082 0.072393
H  2.111469 -0.943655 1.126181
H  2.813346 -1.035306 -0.503783
C  1.82421 0.851541 -0.100849
H  1.867491 1.110725 -1.164976
H  2.658257 1.362185 0.388805
C  0.483966 1.419343 0.510301
C  -0.684413 1.166089 -0.321457
H  0.525492 -1.2655 -1.524017
H  -1.887479 -1.154435 -1.248318
H  0.335663 1.096117 1.543375
H  -0.587903 1.46199 -1.37108
H  -2.820119 0.996253 -0.502118
H  0.622373 2.520184 0.505548
H  -0.319099 -1.339679 1.434744
totalener: -312.28570875 hartree
nucrepener: 380.29593856 hartree
electener: -692.58164731 hartree
oneelecener: -1161.33268573 hartree
twoeener: 468.75103842 hartree
kineticenergy: 310.01732410 hartree
xcener: -23.083463397193 hartree
chargesum: 1.0000000
charge: -0.283006 0.207802 -0.282085 0.191733 -0.156183 -0.144402 -0.303809 0.188413 0.188518 -0.273427 0.181056 0.192473 -0.294115 0.080875 0.208668 0.189746 0.202813 0.266481 0.196681 0.231272 0.210494
charge: 0.093483 0.011527 0.095523 0.001814 0.073860 0.055848 0.068541 -0.000569 0.005399 0.111197 -0.007039 0.000986 0.074180 0.360156 -0.015457 0.001022 0.006301 0.021446 0.011052 0.046321 -0.015592
qa: -0.2830 0.2078 -0.2821 0.1917 -0.1562 -0.1444 -0.3038 0.1884 0.1885 -0.2734 0.1811 0.1925 -0.2941 0.0809 0.2087 0.1897 0.2028 0.2665 0.1967 0.2313 0.2105
va: 3.7142 0.9507 3.7709 0.9559 3.6454 3.6430 3.7793 0.9593 0.9597 3.7222 0.9558 0.9515 3.7479 3.3226 0.9490 0.9593 0.9566 0.9203 0.9599 0.9437 0.9522
energy: -312.285708753675
dipole: 0.46804 -0.96085 -0.49281 1.95280 -0.77249 1.18032 0.14647 -0.28983 -0.14336
magnitude: 1.28707 au
magnitude: 3.27148 debye
