program: Orca
programVersion: 5.0.3
elementType: C H C H C C C H H C H H C C H H H H H H H
charge: 1
multiplicity: 1
keywords: m062x cc-pVTZ EnGrad RIJCOSX verytightscf cc-pVTZ/C def2/J soscf
formula: C8H13
InChI: InChI=1/C8H13/c1-2-4-6-8-7-5-3-1/h1-2,7H,3-6,8H2
21 atoms
C  -2.001526 0.683085 0.073948
H  -2.177148 0.792327 1.148996
C  -1.760842 -0.962024 -0.172013
H  -2.630623 -1.398729 0.32691
C  -0.412113 -1.363819 0.375976
C  0.670936 -1.265213 -0.406151
C  1.979287 -0.707771 0.067492
H  2.171943 -0.934104 1.121385
H  2.842533 -1.037132 -0.519618
C  1.799836 0.831751 -0.121115
H  1.83386 1.092782 -1.184755
H  2.610917 1.375829 0.37035
C  0.4425 1.349196 0.500277
C  -0.746418 1.261009 -0.335913
H  0.515765 -1.198539 -1.487283
H  -1.835842 -1.1413 -1.247283
H  0.267383 0.932158 1.493932
H  -0.651414 1.620099 -1.365599
H  -2.862765 0.990204 -0.522123
H  0.573359 2.448711 0.61797
H  -0.315027 -1.434675 1.45913
totalener: -312.27801605 hartree
nucrepener: 379.19106155 hartree
electener: -691.46907760 hartree
oneelecener: -1159.15688473 hartree
twoeener: 467.68780713 hartree
kineticenergy: 310.01918440 hartree
xcener: -23.082199753086 hartree
chargesum: 1.0000000
charge: -0.313541 0.221225 -0.284570 0.200145 -0.168850 -0.138885 -0.300283 0.184076 0.185611 -0.279380 0.181707 0.189944 -0.282007 0.109207 0.187619 0.200938 0.193834 0.270340 0.202200 0.231670 0.209001
charge: 0.116704 0.015282 0.140249 0.003701 0.034048 0.044396 0.068550 -0.001865 0.001610 0.110604 -0.008560 0.000506 0.081030 0.339739 -0.017362 -0.000836 0.006960 0.025620 0.008743 0.052079 -0.021199
qa: -0.3135 0.2212 -0.2846 0.2001 -0.1689 -0.1389 -0.3003 0.1841 0.1856 -0.2794 0.1817 0.1899 -0.2820 0.1092 0.1876 0.2009 0.1938 0.2703 0.2022 0.2317 0.2090
va: 3.7344 0.9443 3.7716 0.9520 3.6245 3.6525 3.7754 0.9607 0.9596 3.7263 0.9558 0.9528 3.7527 3.3122 0.9567 0.9521 0.9633 0.9167 0.9606 0.9439 0.9521
energy: -312.278016046325
dipole: 0.32115 -1.05863 -0.73749 1.97318 -0.60483 1.36835 0.19851 -0.34501 -0.14650
magnitude: 1.56132 au
magnitude: 3.96856 debye
