program: Orca
programVersion: 5.0.3
elementType: C H C H C C C H H C H H C C H H H H H H H
charge: 1
multiplicity: 1
keywords: DSD-PBEP86/2013 def2-TZVP D3BJ RIJCOSX verytightscf def2-TZVP/C def2/J soscf noTRAH
formula: C8H13
InChI: InChI=1/C8H13/c1-2-4-6-8-7-5-3-1/h1-2,7H,3-6,8H2
21 atoms
C  -1.990021 0.563875 0.102712
H  -2.166221 0.74598 1.167816
C  -1.867913 -0.971682 -0.174687
H  -2.662075 -1.52519 0.333196
C  -0.464513 -1.264377 0.328862
C  0.636245 -1.208691 -0.462419
C  1.927516 -0.684158 0.072492
H  2.070436 -0.946591 1.126011
H  2.796115 -1.037823 -0.492235
C  1.841634 0.86967 -0.081631
H  1.901286 1.135466 -1.143724
H  2.687821 1.351672 0.416229
C  0.51158 1.453257 0.510696
C  -0.640955 1.074135 -0.309186
H  0.530066 -1.296692 -1.544413
H  -1.93998 -1.168518 -1.249219
H  0.373509 1.199908 1.565275
H  -0.521723 1.262389 -1.380629
H  -2.792392 1.023043 -0.48595
H  0.612584 2.553675 0.435589
H  -0.330623 -1.258749 1.412117
totalener: -311.15399329 hartree
nucrepener: 381.46619396 hartree
electener: -692.62018725 hartree
oneelecener: -1163.32823738 hartree
twoeener: 470.70805014 hartree
kineticenergy: 310.01841180 hartree
exchangeener: -14.124549950450 hartree
correlationener: -0.944488886542 hartree
xcener: -15.069038836992 hartree
chargesum: 1.0000000
charge: -0.205128 0.170897 -0.206135 0.176603 -0.135583 -0.133344 -0.220256 0.156232 0.168499 -0.239191 0.150189 0.173911 -0.181379 0.073844 0.173506 0.163225 0.160865 0.206227 0.181133 0.199109 0.166776
charge: -0.196868 0.158699 -0.194605 0.150505 -0.092978 -0.112333 -0.218131 0.151221 0.154670 -0.199458 0.145217 0.150506 -0.217106 0.173313 0.156448 0.152755 0.156798 0.173893 0.159971 0.190352 0.157131
qa: -0.2051 0.1709 -0.2061 0.1766 -0.1356 -0.1333 -0.2203 0.1562 0.1685 -0.2392 0.1502 0.1739 -0.1814 0.0738 0.1735 0.1632 0.1609 0.2062 0.1811 0.1991 0.1668
va: 3.8444 0.9691 3.8529 0.9697 3.8665 3.8581 3.8988 0.9715 0.9707 3.8685 0.9714 0.9635 3.8810 3.5572 0.9614 0.9737 0.9742 0.9420 0.9686 0.9583 0.9639
total: -311.806502962 hartree
dispcorr: -0.014283002 hartree
energy: -311.820785964309
dipole: 0.52363 -0.99224 -0.46861 1.90836 -0.98267 0.92569 0.14980 -0.32068 -0.17088
magnitude: 1.05152 au
magnitude: 2.67276 debye
