program: Orca
programVersion: 5.0.3
elementType: C H C H C C C H H C H H C C H H H H H H H
charge: 1
multiplicity: 1
keywords: DSD-PBEP86 def2-TZVP D3BJ RIJCOSX verytightscf def2-TZVP/C def2/J soscf noTRAH
formula: C8H13
InChI: InChI=1/C8H13/c1-2-4-6-8-7-5-3-1/h1-2,7H,3-6,8H2
21 atoms
C  -1.992649 0.547129 0.114293
H  -2.168165 0.733518 1.177851
C  -1.905371 -0.982192 -0.174544
H  -2.669675 -1.555368 0.355098
C  -0.487066 -1.216335 0.307058
C  0.624869 -1.174847 -0.482459
C  1.91625 -0.670971 0.070846
H  2.038667 -0.949695 1.122861
H  2.782061 -1.040381 -0.486759
C  1.861597 0.888062 -0.061556
H  1.944877 1.163549 -1.119729
H  2.71303 1.341615 0.453373
C  0.533711 1.473352 0.504251
C  -0.600501 0.970957 -0.292273
H  0.53319 -1.308516 -1.560328
H  -1.994523 -1.180327 -1.247301
H  0.404001 1.283295 1.573845
H  -0.466092 1.07022 -1.372934
H  -2.763579 1.056273 -0.475271
H  0.582202 2.569036 0.365136
H  -0.344612 -1.181897 1.388821
totalener: -311.14347439 hartree
nucrepener: 383.00407830 hartree
electener: -694.14755270 hartree
oneelecener: -1166.34934418 hartree
twoeener: 472.20179148 hartree
kineticenergy: 310.01579263 hartree
exchangeener: -13.670780034143 hartree
correlationener: -0.924347472367 hartree
xcener: -14.595127506510 hartree
chargesum: 1.0000000
charge: -0.206344 0.167470 -0.203083 0.177250 -0.107685 -0.114618 -0.222061 0.156553 0.171396 -0.234854 0.149933 0.173805 -0.195961 0.039703 0.186351 0.161391 0.157917 0.198723 0.179474 0.193023 0.171616
charge: -0.197257 0.155429 -0.193585 0.149950 -0.073823 -0.079959 -0.214092 0.152215 0.155349 -0.203851 0.145711 0.150375 -0.221317 0.131839 0.159427 0.152491 0.154843 0.172492 0.157155 0.184183 0.162424
qa: -0.2063 0.1675 -0.2031 0.1773 -0.1077 -0.1146 -0.2221 0.1566 0.1714 -0.2349 0.1499 0.1738 -0.1960 0.0397 0.1864 0.1614 0.1579 0.1987 0.1795 0.1930 0.1716
va: 3.8545 0.9714 3.8547 0.9710 3.8550 3.8519 3.9007 0.9707 0.9699 3.8648 0.9719 0.9646 3.9036 3.6163 0.9560 0.9744 0.9725 0.9460 0.9695 0.9612 0.9626
total: -311.816149885 hartree
dispcorr: -0.011984091 hartree
energy: -311.828133976280
dipole: 0.55419 -0.91897 -0.36478 1.87342 -1.28825 0.58517 0.16350 -0.33363 -0.17014
magnitude: 0.71024 au
magnitude: 1.80528 debye
