program: Orca
programVersion: 5.0.3
elementType: C H C H C C C H H C H H C C H H H H H H H
charge: 1
multiplicity: 1
keywords: DSD-PBEP86/2013 cc-pVTZ EnGrad D3BJ RIJCOSX verytightscf cc-pVTZ/C def2/J soscf
formula: C8H13
InChI: InChI=1/C8H13/c1-3-7-5-2-6-8(4-1)9-7/h3,6-8H,1-2,4-5H2
21 atoms
C  -1.991489 0.666107 0.108018
H  -2.177215 0.857683 1.169354
C  -1.831927 -0.936056 -0.129131
H  -2.645607 -1.437143 0.398212
C  -0.458382 -1.337146 0.390294
C  0.684622 -1.269182 -0.370592
C  1.993751 -0.665785 0.096619
H  2.183903 -0.867242 1.155348
H  2.848597 -1.011249 -0.487549
C  1.833603 0.936029 -0.127359
H  1.925612 1.158561 -1.19518
H  2.645725 1.436381 0.403155
C  0.458114 1.326783 0.397785
C  -0.68806 1.278683 -0.360054
H  0.543449 -1.253497 -1.455015
H  -1.926389 -1.148787 -1.198705
H  0.001982 -0.000369 0.091094
H  -0.553799 1.284588 -1.445293
H  -2.850876 1.012313 -0.46897
H  0.347706 1.331269 1.485248
H  -0.346249 -1.361922 1.47723
totalener: -311.09294782 hartree
nucrepener: 382.87457729 hartree
electener: -693.96752510 hartree
oneelecener: -1165.62433153 hartree
twoeener: 471.65680643 hartree
kineticenergy: 309.66772542 hartree
exchangeener: -14.115217731515 hartree
correlationener: -0.949323615310 hartree
xcener: -15.064541346825 hartree
chargesum: 1.0000000
charge: -0.254544 0.173003 -0.259639 0.186625 -0.065142 -0.051456 -0.254138 0.172679 0.185948 -0.259226 0.170066 0.186507 -0.065508 -0.051796 0.183980 0.170304 0.081954 0.185011 0.185961 0.189298 0.190114
charge: 0.108820 -0.003357 0.112224 0.001392 0.133514 0.147997 0.108878 -0.003431 0.002043 0.112274 -0.004018 0.001288 0.132308 0.149265 0.003269 -0.003965 -0.011090 0.002819 0.002106 0.004091 0.003575
qa: -0.2545 0.1730 -0.2596 0.1866 -0.0651 -0.0515 -0.2541 0.1727 0.1859 -0.2592 0.1701 0.1865 -0.0655 -0.0518 0.1840 0.1703 0.0820 0.1850 0.1860 0.1893 0.1901
va: 3.8962 0.9810 3.9053 0.9737 3.7981 3.8040 3.8960 0.9812 0.9739 3.9053 0.9825 0.9738 3.7993 3.8032 0.9829 0.9823 1.1497 0.9823 0.9738 0.9823 0.9817
dispcorr: -0.014340841 hartree
energy: -311.792857970792
dipole: -0.00292 -0.00176 -0.00468 0.00124 -0.00169 -0.00045 -0.06616 0.05597 -0.01019
magnitude: 0.01122 au
magnitude: 0.02852 debye
