program: Orca
programVersion: 5.0.3
elementType: C H C H C C C H H C H H C C H H H H H H H
charge: 1
multiplicity: 1
keywords: b3lyp def2-TZVP EnGrad RIJCOSX verytightscf def2/J soscf
formula: C8H13
InChI: InChI=1/C8H13/c1-2-4-6-8-7-5-3-1/h1-2,7H,3-6,8H2
21 atoms
C  -1.989882 0.570377 0.098425
H  -2.166428 0.750751 1.164138
C  -1.856434 -0.968164 -0.174319
H  -2.659115 -1.515186 0.327632
C  -0.457667 -1.27734 0.335576
C  0.640117 -1.218003 -0.455802
C  1.932067 -0.688076 0.072655
H  2.081688 -0.945664 1.126391
H  2.800774 -1.037109 -0.495145
C  1.836258 0.864184 -0.087615
H  1.890204 1.127564 -1.150514
H  2.679537 1.354744 0.406856
C  0.503952 1.444671 0.511421
C  -0.653613 1.103219 -0.313295
H  0.528773 -1.28962 -1.538805
H  -1.923998 -1.164912 -1.249196
H  0.363283 1.170667 1.560233
H  -0.541197 1.324252 -1.379392
H  -2.800597 1.013871 -0.490465
H  0.61822 2.545558 0.456769
H  -0.326943 -1.282509 1.419113
totalener: -312.23552097 hartree
nucrepener: 381.07291857 hartree
electener: -693.30843955 hartree
oneelecener: -1163.18748048 hartree
twoeener: 469.87904093 hartree
kineticenergy: 310.52719751 hartree
exchangeener: -36.325204568581 hartree
correlationener: -2.304631975650 hartree
xcener: -38.629836544230 hartree
chargesum: 1.0000000
charge: -0.184488 0.159753 -0.194497 0.164572 -0.102593 -0.082664 -0.209532 0.148786 0.160333 -0.221801 0.145275 0.163108 -0.133119 0.023807 0.158419 0.152555 0.148545 0.192658 0.168692 0.187846 0.154344
charge: -0.199619 0.161101 -0.195170 0.152465 -0.082364 -0.108009 -0.216182 0.153842 0.160188 -0.196335 0.148571 0.153705 -0.215515 0.123959 0.158216 0.154833 0.158181 0.170940 0.162611 0.196881 0.157700
qa: -0.1845 0.1598 -0.1945 0.1646 -0.1026 -0.0827 -0.2095 0.1488 0.1603 -0.2218 0.1453 0.1631 -0.1331 0.0238 0.1584 0.1526 0.1485 0.1927 0.1687 0.1878 0.1543
va: 3.8386 0.9687 3.8319 0.9694 3.8323 3.8084 3.8891 0.9694 0.9701 3.8532 0.9683 0.9641 3.8377 3.6076 0.9651 0.9728 0.9765 0.9481 0.9685 0.9583 0.9664
energy: -312.235520971591
dipole: 0.50993 -0.86389 -0.35396 1.92134 -1.09593 0.82542 0.14750 -0.27050 -0.12300
magnitude: 0.90650 au
magnitude: 2.30413 debye
