program: Gaussian 09
title: 000050865
version: EM64L-G09RevD.01
frameworkgroup: C1[X(C11H18N2O)]
method: RPBEPBE
basis: SDD
operation: Freq
keyword: #p
keyword: freq=noraman
keyword: PBEPBE/SDD
title: #p freq=noraman PBEPBE/SDD
converged: YES YES NO NO
title: Mulliken charges:
elementType: O N N C C C C C C C C C C C H H H H H H H H H H H H H H H H H H
charge: -0.270418 -0.288022 -0.583826 -0.360455 -0.384057 -0.401195 -0.338083 -0.312236 0.367703 -0.351779 -0.381298 -0.223429 -0.197513 -0.258447 0.191905 0.186790 0.212234 0.216957 0.221775 0.178120 0.171439 0.225319 0.203937 0.205839 0.238981 0.247321 0.249067 0.261428 0.298354 0.221548 0.225698 0.226342
chargesum: 0.00000
title: Mulliken charges with hydrogens summed into heavy atoms:
elementType: O N N C C C C C C C C C C C
charge: -0.270418 -0.049042 -0.024044 0.018239 0.015839 0.027996 0.058675 0.097540 0.367703 -0.104457 -0.132230 -0.001881 0.028185 -0.032106
polarizability: 2.03417175e+02 -6.20546098e-01 1.27820865e+02 -1.60897136e+00 -2.09845872e-01 8.17267474e+01
1716.lowfreq: -0.0006 -0.0004 0.0007 6.4633 6.9600 24.9734 26.3285 42.3078 56.1763
frequency: 25.5460 42.2600 54.9324 61.5945 107.3817 112.5231 117.5490 147.2139 155.0623 183.8252 231.7053 234.0271 329.5693 380.0950 392.9168 412.8367 427.3003 477.5464 504.2374 517.5355 583.0541 611.1224 692.8454 722.8923 741.5272 758.4613 780.6081 788.7349 823.1553 857.3672 889.9547 959.8838 964.1113 967.1003 981.6974 984.3144 1011.7549 1022.7851 1026.7184 1064.6848 1077.8087 1084.1681 1106.8747 1144.0786 1152.3263 1165.9242 1166.7358 1178.1671 1218.7534 1221.1329 1237.3555 1242.6292 1268.7543 1287.7329 1290.7493 1302.1708 1313.6156 1348.9671 1369.9766 1377.7198 1392.9912 1443.7469 1467.3371 1469.1459 1470.0563 1474.5853 1482.2767 1491.7403 1496.3834 1591.2166 1612.9061 1648.3718 2860.1031 2942.7168 2955.3554 2962.0948 2995.4827 2999.3104 3002.9408 3030.3919 3051.2159 3064.8867 3126.4023 3135.0120 3154.8886 3163.6517 3172.1446 3329.6028 3407.1094 3593.3424
redmass: 4.5232 4.5814 1.9769 4.0617 2.9944 2.0675 3.3753 2.3196 2.0695 5.5987 4.0142 4.6810 2.0959 1.5267 4.2549 2.9386 1.4271 3.1198 2.8537 3.3506 6.0156 6.4254 2.0285 1.4125 1.0805 1.6566 1.1218 6.0618 1.2452 1.1924 1.4512 1.3433 1.6901 2.9353 1.2973 6.0992 2.8741 2.0743 4.1053 2.5857 2.1425 1.5885 3.1637 1.5707 2.3391 1.4057 1.0972 1.1758 3.3127 1.4488 1.2945 1.4529 1.1646 1.0718 1.1514 1.2722 1.3410 1.3889 1.5790 2.0596 2.9386 2.3831 1.1135 1.1186 1.0921 1.4378 1.3038 1.1757 1.0984 6.4144 6.2414 1.0871 1.0721 1.0550 1.0620 1.0619 1.0616 1.1045 1.0962 1.0930 1.0955 1.1043 1.0846 1.0891 1.0926 1.0950 1.1003 1.0744 1.0476 1.0960
irintensity: 0.2684 0.1391 4.7349 1.2120 4.8388 2.8162 1.2370 1.8535 2.0721 0.3244 3.7153 2.5739 25.9245 74.7643 3.6121 0.0477 171.7364 11.5124 12.3978 7.5764 6.3636 0.5558 35.6345 89.6185 18.5035 85.8874 1.1399 18.7794 0.3347 0.3271 8.1873 0.5314 12.5988 32.4456 0.6433 5.9688 6.1002 16.6006 31.8025 4.2649 2.0354 13.1318 0.4116 2.6011 4.4480 0.4928 11.4444 47.6985 237.8754 0.0184 8.7653 7.8902 0.1274 0.2301 0.8583 1.1159 0.8177 4.5964 7.1347 2.9471 26.3870 2.2787 5.2052 16.8201 8.1954 70.4212 41.0893 0.4716 9.0750 23.7951 84.7648 6.0015 103.6625 28.8368 4.2357 62.3862 31.2875 29.8578 10.0651 12.2413 24.7184 112.9241 3.0474 13.4606 34.8102 24.2464 4.9052 23.6811 26.7100 2.8819
temp: 298.150 k
press: 1.00000 atm
elementType: 8 7 7 6 6 6 6 6 6 6 6 6 6 6 1 1 1 1 1 1 1 1 1 1 1 1 1 1 1 1 1 1
symmnumber: 1
zpe: 721895.4 jmol-1
zpe.correction: 0.274955 hartree
zpe.thermalcorrener: 0.290275 hartree
zpe.thermalcorrenthalpy: 0.291219 hartree
zpe.thermalcorrgfe: 0.230624 hartree
zpe.sumelectzpe: -613.545729 hartree
zpe.sumelectthermal: -613.530410 hartree
zpe.sumelectthermalent: -613.529466 hartree
zpe.sumelectthermalfe: -613.590061 hartree
dipole: -1.7781 0.8495 -1.5582
dipole: 2.5123
quadrupole: -72.5296 -83.1527 -87.6125
quadrupole: 3.8358 9.6241 0.2733
quadrupole: 8.5687 -2.0544 -6.5142 3.8358 9.6241 0.2733
hfenergy: -613.8206848 hartree
pointgroup: C01 [X(C11H18N2O1)]
dipole: 0.6936961 0.4183828 0.5662799 debye
polarizability: 203.4364356|0.5620029|126.9642897|-0.5476082|-6.2308773|82.5640619 unknown
InChI: InChI=1S/C11H18N2O/c12-13-9-5-2-6-10-14-11-7-3-1-4-8-11/h1,3-4,7-8,13H,2,5-6,9-10,12H2
charge 0 multiplicity 1
32 atoms
O  -1.34989 -0.758208 0.118965
N  6.102297 -0.345071 0.184482
N  7.298906 0.411252 0.031098
C  2.302517 0.335665 0.003593
C  3.626514 -0.451108 0.124774
C  1.060174 -0.57905 0.102525
C  4.867681 0.458833 0.034957
C  -0.245778 0.209451 -0.016468
C  -2.664691 -0.268636 0.058031
C  -3.005365 1.09414 -0.136286
C  -3.68283 -1.24438 0.208015
C  -4.369664 1.467211 -0.177804
C  -5.035812 -0.856046 0.164548
C  -5.389869 0.502873 -0.028538
H  2.289339 0.880414 -0.963319
H  2.259306 1.108509 0.799517
H  1.063511 -1.118432 1.069256
H  1.090144 -1.34653 -0.694137
H  3.691009 -1.216029 -0.672866
H  3.633962 -0.999163 1.091813
H  4.78752 1.272555 0.80009
H  4.917549 0.951085 -0.952503
H  -0.32157 0.975443 0.784347
H  -0.314537 0.719506 -1.000619
H  6.077468 -0.919793 1.044814
H  -2.232594 1.85936 -0.254822
H  -3.390164 -2.288461 0.356751
H  7.648533 0.935418 0.843262
H  8.010359 -0.063679 -0.524574
H  -4.630007 2.521224 -0.328728
H  -5.817293 -1.615316 0.281882
H  -6.442925 0.801263 -0.061758
